{"text_format":"1","workbook":"xlsx","n_sheets":7,"sheets":["記入","申請書","月16回以上施術","基本","カルテ","頻回施術理由（表）","頻回施術理由（裏）"],"not_rendered":{"charts":0,"images":1,"macros":1,"external_links":0,"defined_names":6,"comments":0,"pivot_tables":0},"unopened":[],"bounds":{"document_bytes":16777216,"sheet_cells":100000,"rows_first":2000,"rows_last":500,"rows_between":2000,"halvings":0,"cell_chars":16384,"cell_head_chars":4096},"cells_cut":0,"cells_raw":0,"read":"whole","date_system":"1900"}

{"sheet":"記入","index":0,"n_rows":310,"n_cols":682,"rows_kept":310,"cut":false,"hidden":false,"merged":[[4,134,5,139],[8,107,8,109]]}
[]
[null,null,null,null,null,null,null,null,null,null,null,null,null,null,null,null,null,null,null,null,null,null,null,null,null,null,null,null,null,null,null,null,null,null,null,null,null,null,null,null,null,null,null,null,null,null,null,null,null,null,null,null,null,null,null,null,null,null,null,null,null,null,null,null,null,null,null,null,null,null,null,null,null,null,null,null,null,null,null,null,null,null,null,null,null,null,null,null,null,null,null,null,null,null,null,null,null,null,null,null,"=MONTH(TODAY()-10)",null,null,null,null,null,null,null,null,null,null,null,null,null,null,null,null,null,null,null,null,null,null,null,null,null,null,null,null,null,null,null,null,null,null,null,null,null,null,null,null,null,null,null,null,null,null,null,null,null,null,null,null,null,null,null,null,null,null,null,null,null,null,null,null,null,null,null,null,null,null,null,null,null,null,null,null,null,null,null,null,null,null,null,null,null,null,null,null,null,null,null,null,null,null,null,null,null,null,"セル毎にプラス記号で足したらvaiueエラーが出るがsumで計算するとエラーがでない",null,null,null,null,null,null,null,null,null,null,null,null,null,null,null,null,null,null,null,null,null,null,null,null,null,null,null,null,null,null,null,null,null,null,null,null,null,null,null,null,null,null,null,null,null,null,null,null,null,null,null,null,null,null,"銀行口座","カウンタ",1,2,3,4,5,6,7,8]
[null,null,null,null,null,null,null,null,null,null,null,null,null,null,null,null,null,null,null,null,null,null,null,null,null,null,null,null,null,null,null,null,null,"①はり",null,"①電気鍼",null,null,null,null,null,null,null,null,null,null,null,null,null,"世帯主",null,null,null,null,null,null,null,null,null,null,null,null,null,null,null,null,null,null,null,null,null,null,null,null,null,null,null,null,null,null,null,null,null,null,null,null,null,null,null,null,null,null,null,null,null,null,null,null,null,null,null,null,null,null,null,null,null,null,null,null,null,null,null,null,null,null,null,null,null,null,null,null,null,null,null,null,null,null,null,null,null,null,null,null,null,null,null,null,null,null,null,null,null,null,null,null,null,null,null,null,null,null,null,null,null,null,null,null,null,null,null,null,null,null,null,null,null,null,null,null,null,null,null,null,null,null,null,null,null,null,null,null,null,null,null,null,null,null,null,null,null,null,null,null,null,null,null,null,null,null,null,null,null,null,null,null,null,null,null,null,null,null,null,null,null,null,null,null,null,null,null,null,null,null,null,null,null,null,null,null,null,null,null,null,null,null,null,null,null,null,null,null,null,null,null,null,null,null,null,null,null,null,null,null,{"$f":"基本!C28","v":"6637113"},{"$f":"IF(LEN(IU3)=0,\"\",LEN(IU3))","v":7},{"$f":"IF(IV3=8,LEFT(IU3),\"\")","v":""},{"$f":"IF(IV3=8,MID(IU3,2,1),IF(IV3=7,LEFT(IU3),\"\"))","v":"6"},{"$f":"IF(IV3=8,MID(IU3,3,1),IF(IV3=7,MID(IU3,2,1),IF(IV3=6,LEFT(IU3),\"\")))","v":"6"},{"$f":"IF(IV3=8,MID(IU3,4,1),IF(IV3=7,MID(IU3,3,1),IF(IV3=6,MID(IU3,2,1),IF(IV3=5,LEFT(IU3),\"\"))))","v":"3"},{"$f":"IF(IV3=8,MID(IU3,5,1),IF(IV3=7,MID(IU3,4,1),IF(IV3=6,MID(IU3,3,1),IF(IV3=5,MID(IU3,2,1),IF(IV3=4,LEFT(IU3),\"\")))))","v":"7"},{"$f":"IF(IV3=8,MID(IU3,6,1),IF(IV3=7,MID(IU3,5,1),IF(IV3=6,MID(IU3,4,1),IF(IV3=5,MID(IU3,3,1),IF(IV3=4,MID(IU3,2,1),IF(IV3=3,LEFT(IU3),\"\"))))))","v":"1"},{"$f":"IF(IV3=8,MID(IU3,7,1),IF(IV3=7,MID(IU3,6,1),IF(IV3=6,MID(IU3,5,1),IF(IV3=5,MID(IU3,4,1),IF(IV3=4,MID(IU3,3,1),IF(IV3=3,MID(IU3,2,1),IF(IV3=2,LEFT(IU3),\"\")))))))","v":"1"},{"$f":"IF(RIGHT(IV3)=0,\"\",RIGHT(IU3))","v":"3"}]
[null,null,null,null,null,null,null,null,null,null,null,null,null,null,null,null,null,null,null,null,null,null,null,null,null,null,null,null,null,null,null,null,null,"②きゅう",null,"②電気温灸器",null,null,null,null,null,null,null,null,null,null,null,null,null,"世帯主",null,null,null,null,null,null,null,null,null,null,null,null,null,null,null,null,null,null,null,null,null,null,null,null,null,null,null,null,null,null,null,null,null,null,null,null,null,null,null,null,null,null,null,null,null,null,null,null,null,{"$f":"DATE(YEAR(CV5), 1, 1)","v":1828},null,null,"うるう年","最終"]
[null,null,null,null,null,null,null,null,null,null,null,null,null,null,null,null,null,null,null,null,null,null,null,null,null,null,null,null,null,null,null,null,null,"③はりきゅう",null,"③電気光線器具",null,null,null,null,null,null,null,null,null,null,null,null,null,"被保険者",null,null,null,null,null,null,null,null,null,null,null,null,null,null,null,null,null,null,null,null,null,null,null,null,null,null,null,null,null,null,null,null,null,null,null,null,null,null,null,null,null,null,null,null,null,null,null,null,null,{"$f":"YEAR(TODAY()-10)","v":2022},{"$f":"MONTH(TODAY()-10)","v":10},null,{"$f":"IF(CV5=2012,29,IF(CV5=2016,29,IF(CV5=2020,29,IF(CV5=2024,29,IF(CV5=2028,29,IF(CV5=2032,29,IF(CV5=2036,29,28)))))))","v":28},{"$f":"IF(CW5=2,CY5,IF(CW5=4,30,IF(CW5=6,30,IF(CW5=9,30,IF(CW5=11,30,31)))))","v":31},null,null,null,null,null,null,null,null,null,null,null,null,null,null,null,null,null,null,null,null,null,null,null,null,null,null,null,null,null,null,"施術の期間",null,null,null,null,null,null,null,null,null,null,null,null,null,null,null,null,null,null,null,null,null,null,null,null,null,null,null,null,null,null,null,null,null,null,null,null,null,null,null,null,null,null,null,null,null,null,null,null,null,null,null,null,null,null,null,null,null,null,null,null,null,null,null,null,null,null,null,null,null,null,null,null,null,null,null,null,null,null,null,null,null,null,null,null,null,null,null,null,null,null,null,null,null,null,null,null,null,null,null,null,null,null,null,null,null,null,null,null,null,null,null,null,null,null,null,null,null,null,null,"施術者コード","カウンタ",1,2,3,4,5,6,7,8,9,10]
[null,null,null,null,null,null,null,null,null,null,null,null,null,null,null,null,null,null,null,null,null,null,null,null,null,null,null,null,null,null,null,null,null,null,null,null,null,null,null,null,null,null,null,null,null,null,null,null,null,"世帯主",null,null,null,null,null,null,null,null,null,null,null,null,null,null,null,null,null,null,null,null,null,null,null,null,null,null,null,null,null,null,null,null,null,null,null,null,null,null,null,null,null,null,null,null,null,null,null,null,null,{"$f":"基本!I5","v":0},{"$f":"VALUE(YEAR(TODAY()-10)-2018)","v":4},null,null,null,null,null,null,null,null,null,null,null,null,null,null,null,null,null,null,null,null,null,null,null,null,null,null,null,null,null,null,null,null,null,null,null,null,null,null,null,null,null,null,null,null,null,null,null,null,null,null,null,null,null,null,null,null,null,null,null,null,null,null,null,null,null,null,null,null,null,null,null,null,null,null,null,null,null,null,null,null,null,null,null,null,null,null,null,null,null,null,null,null,null,null,null,null,null,null,null,null,null,null,null,null,null,null,null,null,null,null,null,null,null,null,null,null,null,null,null,null,null,null,null,null,null,null,null,null,null,null,null,null,null,null,null,null,null,null,null,null,null,null,null,null,null,null,null,null,null,null,null,null,null,{"$f":"基本!C9","v":"4081600477"},{"$f":"IF(LEN(IU6)=0,\"\",LEN(IU6))","v":10},{"$f":"IF($IV$6=10,LEFT($IU$6))","v":"4"},{"$f":"IF($IV$6=10,MID($IU$6,2,1))","v":"0"},{"$f":"IF($IV$6=10,MID($IU$6,3,1))","v":"8"},{"$f":"IF($IV$6=10,MID($IU$6,4,1))","v":"1"},{"$f":"IF($IV$6=10,MID($IU$6,5,1))","v":"6"},{"$f":"IF($IV$6=10,MID($IU$6,6,1))","v":"0"},{"$f":"IF($IV$6=10,MID($IU$6,7,1))","v":"0"},{"$f":"IF($IV$6=10,MID($IU$6,8,1))","v":"4"},{"$f":"IF($IV$6=10,MID($IU$6,9,1))","v":"7"},{"$f":"IF(RIGHT(IV6)=0,\"\",RIGHT(IU6))","v":"7"},null,null,null,null,null,null,null,null,null,null,null,null,null,null,null,null,null,null,null,null,1,null,null,null,null,null,null,null,null,null,null,null,null,null,null,null,null,null,null,null,null,null,null,null,null,null,null,null,null,null,null,null,null,2,null,null,null,null,null,null,null,null,null,null,null,null,null,null,null,null,null,null,null,null,null,null,null,null,null,null,null,null,null,null,null,null,3,null,null,null,null,null,null,null,null,null,null,null,null,null,null,null,null,null,null,null,null,null,null,null,null,null,null,null,null,null,null,null,null,4,null,null,null,null,null,null,null,null,null,null,null,null,null,null,null,null,null,null,null,null,null,null,null,null,null,null,null,null,null,null,null,null,5,null,null,null,null,null,null,null,null,null,null,null,null,null,null,null,null,null,null,null,null,null,null,null,null,null,null,null,null,null,null,null,null,6,null,null,null,null,null,null,null,null,null,null,null,null,null,null,null,null,null,null,null,null,null,null,null,null,null,null,null,null,null,null,null,null,7,null,null,null,null,null,null,null,null,null,null,null,null,null,null,null,null,null,null,null,null,null,null,null,null,null,null,null,null,null,null,null,null,8,null,null,null,null,null,null,null,null,null,null,null,null,null,null,null,null,null,null,null,null,null,null,null,null,null,null,null,null,null,null,null,null,9,null,null,null,null,null,null,null,null,null,null,null,null,null,null,null,null,null,null,null,null,null,null,null,null,null,null,null,null,null,null,null,null,10,null,null,null,null,null,null,null,null,null,null,null,null,null,null,null,null,null,null,null,null,null,null,null,null,null,null,null,null,null,null,null,null,11,null,null,null,null,null,null,null,null,null,null,null,null,null,null,null,null,null,null,null,null,null,null,null,null,null,null,null,null,null,null,null,null,12]
[null,null,null,null,null,null,null,null,null,null,null,null,null,null,null,null,null,null,null,null,null,null,null,null,null,null,null,null,null,null,null,null,null,null,null,null,null,null,null,null,null,null,null,null,null,null,null,null,null,null,null,null,null,null,null,null,null,null,null,null,null,null,null,null,null,null,null,null,null,null,null,null,null,null,null,null,null,null,null,null,null,null,null,null,null,null,null,null,null,null,null,null,null,null,null,null,null,null,null,null,null,null,null,null,null,null,null,null,null,null,null,null,null,null,null,null,null,null,null,null,null,null,null,null,null,null,null,null,null,null,null,null,null,null,null,null,null,null,null,null,null,null,null,null,null,null,null,null,null,null,null,null,null,null,null,null,null,null,null,null,null,null,null,null,null,null,null,null,null,null,null,null,null,null,null,null,null,null,null,null,null,null,null,null,null,null,null,null,null,null,null,null,null,null,null,null,null,null,null,null,null,null,null,null,null,null,null,null,null,null,null,null,null,null,null,null,null,null,null,null,null,null,null,null,null,null,null,null,null,null,null,null,null,null,null,null,null,null,null,null,null,null,null,null,null,null,null,null,null,null,null,null,null,null,null,null,null,null,null,null,null,null,null,null,null,null,null,null,null,null,null,null,null,null,null,null,null,null,null,null,null,null,null,null,null,null,"月",null,null,null,null,null,null,null,null,null,null,null,null,null,null,null,null,null,null,null,null,null,null,null,null,null,null,null,null,null,null,null,null,"月",null,null,null,null,null,null,null,null,null,null,null,null,null,null,null,null,null,null,null,null,null,null,null,null,null,null,null,null,null,null,null,null,"月",null,null,null,null,null,null,null,null,null,null,null,null,null,null,null,null,null,null,null,null,null,null,null,null,null,null,null,null,null,null,null,null,"月",null,null,null,null,null,null,null,null,null,null,null,null,null,null,null,null,null,null,null,null,null,null,null,null,null,null,null,null,null,null,null,null,"月",null,null,null,null,null,null,null,null,null,null,null,null,null,null,null,null,null,null,null,null,null,null,null,null,null,null,null,null,null,null,null,null,"月",null,null,null,null,null,null,null,null,null,null,null,null,null,null,null,null,null,null,null,null,null,null,null,null,null,null,null,null,null,null,null,null,"月",null,null,null,null,null,null,null,null,null,null,null,null,null,null,null,null,null,null,null,null,null,null,null,null,null,null,null,null,null,null,null,null,"月",null,null,null,null,null,null,null,null,null,null,null,null,null,null,null,null,null,null,null,null,null,null,null,null,null,null,null,null,null,null,null,null,"月",null,null,null,null,null,null,null,null,null,null,null,null,null,null,null,null,null,null,null,null,null,null,null,null,null,null,null,null,null,null,null,null,"月",null,null,null,null,null,null,null,null,null,null,null,null,null,null,null,null,null,null,null,null,null,null,null,null,null,null,null,null,null,null,null,null,"月",null,null,null,null,null,null,null,null,null,null,null,null,null,null,null,null,null,null,null,null,null,null,null,null,null,null,null,null,null,null,null,null,"月"]
[null,1,2,3,4,5,6,7,8,9,10,11,12,13,14,15,16,17,18,19,20,21,22,23,24,25,26,27,28,29,30,31,32,33,34,35,36,37,38,39,40,41,42,43,44,45,46,47,48,49,50,51,52,53,54,55,56,57,58,59,60,61,62,63,64,65,66,67,68,69,70,71,72,73,74,75,76,77,78,79,80,81,82,83,84,85,86,87,88,89,90,91,92,93,94,95,96,97,98,99,100,101,102,103,104,105,106,107,108,109,110,111,112,113,114,115,116,117,118,119,120,121,122,123,124,125,126,127,128,129,130,131,132,133,134,135,136,137,138,139,140,141,142,143,144,145,146,147,148,149,150,151,152,153,154,155,156,157,158,159,160,161,162,163,164,165,166,167,168,169,170,171,172,173,174,175,176,177,178,179,180,181,182,183,184,185,186,187,188,189,190,191,192,193,194,195,196,197,198,199,200,201,202,203,204,205,206,207,208,209,210,211,212,213,214,215,216,217,218,219,220,221,222,223,224,225,226,227,228,229,230,231,232,233,234,235,236,237,238,239,240,241,242,243,244,245,246,247,248,249,250,251,252,253,254,255,256,257,258,259,260,261,262,263,264,265,266,267,268,269,270,271,272,273,274,275,276,277,278,279,280,281,282,283,284,285,286,287,288,289,290,291,292,293,294,295,296,297,298,299,300,301,302,303,304,305,306,307,308,309,310,311,312,313,314,315,316,317,318,319,320,321,322,323,324,325,326,327,328,329,330,331,332,333,334,335,336,337,338,339,340,341,342,343,344,345,346,347,348,349,350,351,352,353,354,355,356,357,358,359,360,361,362,363,364,365,366,367,368,369,370,371,372,373,374,375,376,377,378,379,380,381,382,383,384,385,386,387,388,389,390,391,392,393,394,395,396,397,398,399,400,401,402,403,404,405,406,407,408,409,410,411,412,413,414,415,416,417,418,419,420,421,422,423,424,425,426,427,428,429,430,431,432,433,434,435,436,437,438,439,440,441,442,443,444,445,446,447,448,449,450,451,452,453,454,455,456,457,458,459,460,461,462,463,464,465,466,467,468,469,470,471,472,473,474,475,476,477,478,479,480,481,482,483,484,485,486,487,488,489,490,491,492,493,494,495,496,497,498,499,500,501,502,503,504,505,506,507,508,509,510,511,512,513,514,515,516,517,518,519,520,521,522,523,524,525,526,527,528,529,530,531,532,533,534,535,536,537,538,539,540,541,542,543,544,545,546,547,548,549,550,551,552,553,554,555,556,557,558,559,560,561,562,563,564,565,566,567,568,569,570,571,572,573,574,575,576,577,578,579,580,581,582,583,584,585,586,587,588,589,590,591,592,593,594,595,596,597,598,599,600,601,602,603,604,605,606,607,608,609,610,611,612,613,614,615,616,617,618,619,620,621,622,623,624,625,626,627,628,629,630,631,632,633,634,635,636,637,638,639,640,641,642,643,644,645,646,647,648,649,650,651,652,653,654,655,656,657,658,659,660,661,662,663,664,665,666,667,668,669,670,671,672,673,674,675,676,677,678,679,680,681]
[null,"保険者番号",null,null,"保険種別","本人・家族","記号8桁（左揃え）","番号7桁（右揃え）","何割","生年月日","被保険者(世帯主）","（枝番）01",null,null,"郵便番号","住所",null,"被扶養者名","フリガナ","患者生年月日",null,"傷病名","発病又は負傷年月日","発病原因","初療年月日","新規・継続","被保険者生年月日","摘要","施術報告書交付料","施術交付支給年","施術交付支給月",null,null,null,"施術種別","電料種別",null,null,"往療距離",null,null,"所見・経過","備　考","同意医師住所","同意医師名","再同意日","被保険者性別","被扶養者性別","保険者名","申請資格","申請者電話","転帰","1日","2日","3日","4日","5日","6日","7日","8日","9日","10日","11日","12日","13日","14日","15日","16日","17日","18日","19日","20日","21日","22日","23日","24日","25日","26日","27日","28日","29日","30日","31日","施術日数","氏名","記号8桁","カウンタ",1,2,"番号7桁","カウンタ",3,4,5,"事業者番号","カウンタ",1,2,3,4,5,6,"患者生年月日","年号","年","月","日","年齢計算",null,null,"年齢",null,null,null,null,null,null,null,null,null,null,null,null,"初療年月日","年号","年","月","日","施術月","日","日",null,null,null,null,null,"日","日","日","日","発病負傷年月日","年","月","日","年号",null,null,"往療日数","初検金額","施術金額","電療金額","往療金額","報告書","総合計","協会けんぽ","健保組合","国保一般","後期高齢者","共済組合","退職者国保","国保組合",null,null,null,null,null,null,null,null,null,null,null,null,null,null,null,null,null,null,null,null,null,null,null,null,null,null,null,null,null,null,null,null,null,null,null,null,null,null,null,null,null,null,null,null,null,null,null,null,null,null,null,null,null,"再同意日","年号","年","月","日","傷病名","1日","2日","3日","4日","5日","6日","7日","8日","9日","10日","11日","12日","13日","14日","15日","16日","17日","18日","19日","20日","21日","22日","23日","24日","25日","26日","27日","28日","29日","30日","31日","最終施術日",null,null,"記号8桁","カウンタ",1,2,3,4,5,6,7,8,"番号7桁","カウンタ",1,2,3,4,5,6,7,"保険者番号","カウンタ",1,2,3,4,5,6,7,8,"県別",null,null,"日数","総合計",1,2,3,4,5,6,7,8,9,10,11,12,13,14,15,16,17,18,19,20,21,22,23,24,25,26,27,28,29,30,31,"日数","総合計",1,2,3,4,5,6,7,8,9,10,11,12,13,14,15,16,17,18,19,20,21,22,23,24,25,26,27,28,29,30,31,"日数","総合計",1,2,3,4,5,6,7,8,9,10,11,12,13,14,15,16,17,18,19,20,21,22,23,24,25,26,27,28,29,30,31,"日数","総合計",1,2,3,4,5,6,7,8,9,10,11,12,13,14,15,16,17,18,19,20,21,22,23,24,25,26,27,28,29,30,31,"日数","総合計",1,2,3,4,5,6,7,8,9,10,11,12,13,14,15,16,17,18,19,20,21,22,23,24,25,26,27,28,29,30,31,"日数","総合計",1,2,3,4,5,6,7,8,9,10,11,12,13,14,15,16,17,18,19,20,21,22,23,24,25,26,27,28,29,30,31,"日数","総合計",1,2,3,4,5,6,7,8,9,10,11,12,13,14,15,16,17,18,19,20,21,22,23,24,25,26,27,28,29,30,31,"日数","総合計",1,2,3,4,5,6,7,8,9,10,11,12,13,14,15,16,17,18,19,20,21,22,23,24,25,26,27,28,29,30,31,"日数","総合計",1,2,3,4,5,6,7,8,9,10,11,12,13,14,15,16,17,18,19,20,21,22,23,24,25,26,27,28,29,30,31,"日数","総合計",1,2,3,4,5,6,7,8,9,10,11,12,13,14,15,16,17,18,19,20,21,22,23,24,25,26,27,28,29,30,31,"日数","総合計",1,2,3,4,5,6,7,8,9,10,11,12,13,14,15,16,17,18,19,20,21,22,23,24,25,26,27,28,29,30,31,"日数","総合計",1,2,3,4,5,6,7,8,9,10,11,12,13,14,15,16,17,18,19,20,21,22,23,24,25,26,27,28,29,30,31]
[1,"400044",null,null,"協会けんぽ","本","98765432","12345678",2,"S50/04/16","協会太郎","（枝番）01",null,null,"812-0871","福岡市博多区東雲町2-3-3",null,"協会太郎","キョウカイタロウ","S50/04/16",null,"頚腕症候群","R02/10/05  ","原因不詳・経過良好","R02/04/30","継続","S10/04/16",null,null,null,null,null,null,null,3,2,null,null,null,null,null,"首から方にかけて痛みと痺れがあり、パソコンでの仕事が続けてできない。鍼灸をすると首肩が軽くなり動きがよくなると話す。以前よりも笑顔が増えたと家族が言うとのこと。",null,"福岡市中央区天神2-3-3","伊藤和子","R04/05/01","男","男","全国健康保険協会福岡支部","被保険者","092-235-3402","継続",null,null,null,null,null,null,null,null,null,"○",null,null,null,null,null,null,null,null,null,null,null,null,null,"○",null,null,null,null,null,null,null,{"$f":"COUNTA(BA10:CE10)","v":2},{"$f":"IF(K10=0,\"\",K10)","v":"協会太郎"},{"$f":"IF(G10=0,\"\",G10)","v":"98765432"},{"$f":"IF(LEN(CH10)=0,\"\",LEN(CH10))","v":8},{"$f":"IF(CI10=2,LEFT(CH10),\"\")","v":""},{"$f":"IF(CH10=\"\",\"\",RIGHT(CH10))","v":"2"},{"$f":"IF(H10=0,\"\",H10)","v":"12345678"},{"$f":"IF(LEN(CL10)=0,\"\",LEN(CL10))","v":8},{"$f":"IF(CM10=3,LEFT(CL10),\"\")","v":""},{"$f":"IF(CM10=3,MID(CL10,2,1),IF(CM10=2,LEFT(CL10),\"\"))","v":""},{"$f":"RIGHT(CL10)","v":"8"},{"$f":"IF(I10=0,\"\",I10)","v":2},{"$f":"IF(LEN(CQ10)=0,\"\",LEN(CQ10))","v":1},{"$f":"IF(CR10=7,LEFT(CQ10),\"\")","v":""},{"$f":"IF(CR10=6,MID(CQ10,2,1),IF(CR10=5,LEFT(CQ10),\"\"))","v":""},{"$f":"IF(CR10=6,MID(CQ10,3,1),IF(CR10=5,MID(CQ10,2,1),IF(CR10=4,LEFT(CQ10),\"\")))","v":""},{"$f":"IF(CR10=6,MID(CQ10,4,1),IF(CR10=5,MID(CQ10,3,1),IF(CR10=4,MID(CQ10,2,1),IF(CR10=3,LEFT(CQ10),\"\"))))","v":""},{"$f":"IF(CR10=6,MID(CQ10,5,1),IF(CR10=5,MID(CQ10,4,1),IF(CR10=4,MID(CQ10,3,1),IF(CR10=3,MID(CQ10,2,1),IF(CR10=2,LEFT(CQ10),\"\")))))","v":""},{"$f":"IF(RIGHT(CR10)=0,\"\",RIGHT(CQ10))","v":"2"},{"$f":"IF(T10=0,\"\",T10)","v":"S50/04/16"},{"$f":"LEFT(CY10)","v":"S"},{"$f":"MID(CY10,2,2)","v":"50"},{"$f":"MID(CY10,5,2)","v":"04"},{"$f":"MID(CY10,8,2)","v":"16"},{"$f":"IF($CZ10=\"T\",1911,IF($CZ10=\"S\",1925,IF($CZ10=\"H\",1988,IF($CZ10=\"R\",2018,\"\"))))","v":1925},{"$f":"IF(DD10=\"\",\"\",DD10+DA10)","v":1975},{"$f":"IF(DD10=\"\",\"\",DATE(DE10,DB10,DC10))","v":"1975-04-16"},{"$f":"IF(DD10=\"\",\"\",DATEDIF(DF10,TODAY(),\"Y\"))","v":47},null,null,null,null,null,null,null,null,null,null,null,null,{"$f":"IF(Y10=0,\"\",Y10)","v":"R02/04/30"},{"$f":"LEFT(DT10)","v":"R"},{"$f":"MID(DT10,2,2)","v":"02"},{"$f":"MID(DT10,5,2)","v":"04"},{"$f":"MID(DT10,8,2)","v":"30"},{"$f":"IF(DW10=\"\",\"\",VALUE(DW10))","v":4},{"$f":"IF(DV10=\"\",\"\",IF(VALUE(DV10)=$CW$6,IF(VALUE(DW10)=$CW$5,DX10,1),1))","v":1},{"$f":"IF(DV10=\"\",\"\",$CZ$5)","v":31},null,null,null,null,null,{"$f":"IF(DZ10=1,0,LEFT(DZ10))","v":0},{"$f":"IF(DZ10=1,1,RIGHT(DZ10))","v":1},{"$f":"LEFT(EA10)","v":"3"},{"$f":"MID(EA10,2,1)","v":"1"},{"$f":"IF(W10=0,\"\",W10)","v":"R02/10/05  "},{"$f":"IF(EK10=\"不詳\",\"\",IF(EK10=\"不明\",\"\",MID(EK10,2,2)))","v":"02"},{"$f":"MID(EK10,5,2)","v":"10"},{"$f":"MID(EK10,8,2)","v":"05"},{"$f":"LEFT(EK10)","v":"R"},null,null,{"$f":"COUNTIF(BA10:CE10,\"◎\")","v":0},{"$f":"IF(Z10<>\"新規\",\"\",IF(AI10=3,基本!$E$14,IF(OR(AI10=1,AI10=2),基本!$E$13,\"\")))","v":""},{"$f":"IF(CF10=0,\"\",IF(AI10=3,基本!$E$16*CF10,IF(OR(AI10=1,AI10=2),基本!$E$15*CF10)))","v":3220},{"$f":"IF(AJ10=\"\",\"\",IF(AJ10>0,基本!$E$17*CF10))","v":68},{"$f":"IF(ER10=0,\"\",IF(AM10<=4,基本!$E$18*ER10,IF(AM10>4,基本!$E$19*ER10)))","v":""},{"$f":"IF(AC10=\"\",\"\",IF(AC10>=1,基本!$E$20))","v":""},{"$f":"SUM(ES10:EW10)","v":3288},{"$f":"IF($E10=\"\",\"\",IF($E10=\"協会けんぽ\",$EX10,\"\"))","v":3288},{"$f":"IF($E10=\"\",\"\",IF($E10=\"健保組合\",$EX10,\"\"))","v":""},{"$f":"IF($E10=\"\",\"\",IF($E10=\"国保一般\",$EX10,\"\"))","v":""},{"$f":"IF($E10=\"\",\"\",IF($E10=\"後期高齢者\",$EX10,\"\"))","v":""},{"$f":"IF($E10=\"\",\"\",IF($E10=\"共済組合\",$EX10,\"\"))","v":""},{"$f":"IF($E10=\"\",\"\",IF($E10=\"退職者国保\",$EX10,\"\"))","v":""},{"$f":"IF($E10=\"\",\"\",IF($E10=\"国保組合\",$EX10,\"\"))","v":""},null,null,null,null,null,null,null,null,null,null,null,null,null,null,null,null,null,null,null,null,null,null,null,null,null,null,null,null,null,null,null,null,null,null,null,null,null,null,null,null,null,null,null,null,null,null,null,null,null,null,null,null,null,{"$f":"IF(AT10=0,\"\",AT10)","v":"R04/05/01"},{"$f":"LEFT(HG10,1)","v":"R"},{"$f":"MID(HG10,2,2)","v":"04"},{"$f":"MID(HG10,5,2)","v":"05"},{"$f":"MID(HG10,8,2)","v":"01"},{"$f":"IF(LEFT(V10,3)=\"神経痛\",1,IF(LEFT(V10,3)=\"リウマ\",2,IF(LEFT(V10,3)=\"頚腕症\",3,IF(LEFT(V10,3)=\"五十肩\",4,IF(LEFT(V10,3)=\"腰痛症\",5,IF(LEFT(V10,3)=\"頚椎捻\",6,\"\"))))))","v":3},{"$f":"IF(OR(BA10=\"○\",BA10=\"◎\"),1,\"\")","v":""},{"$f":"IF(OR(BB10=\"○\",BB10=\"◎\"),2,\"\")","v":""},{"$f":"IF(OR(BC10=\"○\",BC10=\"◎\"),3,\"\")","v":""},{"$f":"IF(OR(BD10=\"○\",BD10=\"◎\"),4,\"\")","v":""},{"$f":"IF(OR(BE10=\"○\",BE10=\"◎\"),5,\"\")","v":""},{"$f":"IF(OR(BF10=\"○\",BF10=\"◎\"),6,\"\")","v":""},{"$f":"IF(OR(BG10=\"○\",BG10=\"◎\"),7,\"\")","v":""},{"$f":"IF(OR(BH10=\"○\",BH10=\"◎\"),8,\"\")","v":""},{"$f":"IF(OR(BI10=\"○\",BI10=\"◎\"),9,\"\")","v":""},{"$f":"IF(OR(BJ10=\"○\",BJ10=\"◎\"),10,\"\")","v":10},{"$f":"IF(OR(BK10=\"○\",BK10=\"◎\"),11,\"\")","v":""},{"$f":"IF(OR(BL10=\"○\",BL10=\"◎\"),12,\"\")","v":""},{"$f":"IF(OR(BM10=\"○\",BM10=\"◎\"),13,\"\")","v":""},{"$f":"IF(OR(BN10=\"○\",BN10=\"◎\"),14,\"\")","v":""},{"$f":"IF(OR(BO10=\"○\",BO10=\"◎\"),15,\"\")","v":""},{"$f":"IF(OR(BP10=\"○\",BP10=\"◎\"),16,\"\")","v":""},{"$f":"IF(OR(BQ10=\"○\",BQ10=\"◎\"),17,\"\")","v":""},{"$f":"IF(OR(BR10=\"○\",BR10=\"◎\"),18,\"\")","v":""},{"$f":"IF(OR(BS10=\"○\",BS10=\"◎\"),19,\"\")","v":""},{"$f":"IF(OR(BT10=\"○\",BT10=\"◎\"),20,\"\")","v":""},{"$f":"IF(OR(BU10=\"○\",BU10=\"◎\"),21,\"\")","v":""},{"$f":"IF(OR(BV10=\"○\",BV10=\"◎\"),22,\"\")","v":""},{"$f":"IF(OR(BW10=\"○\",BW10=\"◎\"),23,\"\")","v":""},{"$f":"IF(OR(BX10=\"○\",BX10=\"◎\"),24,\"\")","v":24},{"$f":"IF(OR(BY10=\"○\",BY10=\"◎\"),25,\"\")","v":""},{"$f":"IF(OR(BZ10=\"○\",BZ10=\"◎\"),26,\"\")","v":""},{"$f":"IF(OR(CA10=\"○\",CA10=\"◎\"),27,\"\")","v":""},{"$f":"IF(OR(CB10=\"○\",CB10=\"◎\"),28,\"\")","v":""},{"$f":"IF(OR(CC10=\"○\",CC10=\"◎\"),29,\"\")","v":""},{"$f":"IF(OR(CD10=\"○\",CD10=\"◎\"),30,\"\")","v":""},{"$f":"IF(OR(CE10=\"○\",CE10=\"◎\"),31,\"\")","v":""},{"$f":"IF(MAX(HM10:IQ10)=0,\"\",MAX(HM10:IQ10))","v":24},null,null,{"$f":"IF(G10=\"\",\"\",G10)","v":"98765432"},{"$f":"IF(LEN(IU10)=0,\"\",LEN(IU10))","v":8},{"$f":"IF(IV10=8,LEFT(IU10),\"\")","v":"9"},{"$f":"IF(IV10=8,MID(IU10,2,1),IF(IV10=7,LEFT(IU10),\"\"))","v":"8"},{"$f":"IF(IV10=8,MID(IU10,3,1),IF(IV10=7,MID(IU10,2,1),IF(IV10=6,LEFT(IU10),\"\")))","v":"7"},{"$f":"IF(IV10=8,MID(IU10,4,1),IF(IV10=7,MID(IU10,3,1),IF(IV10=6,MID(IU10,2,1),IF(IV10=5,LEFT(IU10),\"\"))))","v":"6"},{"$f":"IF(IV10=8,MID(IU10,5,1),IF(IV10=7,MID(IU10,4,1),IF(IV10=6,MID(IU10,3,1),IF(IV10=5,MID(IU10,2,1),IF(IV10=4,LEFT(IU10),\"\")))))","v":"5"},{"$f":"IF(IV10=8,MID(IU10,6,1),IF(IV10=7,MID(IU10,5,1),IF(IV10=6,MID(IU10,4,1),IF(IV10=5,MID(IU10,3,1),IF(IV10=4,MID(IU10,2,1),IF(IV10=3,LEFT(IU10),\"\"))))))","v":"4"},{"$f":"IF(IV10=8,MID(IU10,7,1),IF(IV10=7,MID(IU10,6,1),IF(IV10=6,MID(IU10,5,1),IF(IV10=5,MID(IU10,4,1),IF(IV10=4,MID(IU10,3,1),IF(IV10=3,MID(IU10,2,1),IF(IV10=2,LEFT(IU10),\"\")))))))","v":"3"},{"$f":"IF(RIGHT(IV10)=0,\"\",RIGHT(IU10))","v":"2"},{"$f":"IF(H10=\"\",\"\",H10)","v":"12345678"},{"$f":"IF(LEN(JE10)=0,\"\",LEN(JE10))","v":8},{"$f":"IF(JF10=7,LEFT(JE10),\"\")","v":""},{"$f":"IF(JF10=7,MID(JE10,2,1),IF(JF10=6,LEFT(JE10),\"\"))","v":""},{"$f":"IF(JF10=7,MID(JE10,3,1),IF(JF10=6,MID(JE10,2,1),IF(JF10=5,LEFT(JE10,1),\"\")))","v":""},{"$f":"IF(JF10=7,MID(JE10,4,1),IF(JF10=6,MID(JE10,3,1),IF(JF10=5,MID(JE10,2,1),IF(JF10=4,LEFT(JE10,1),\"\"))))","v":""},{"$f":"IF(JF10=7,MID(JE10,5,1),IF(JF10=6,MID(JE10,4,1),IF(JF10=5,MID(JE10,3,1),IF(JF10=4,MID(JE10,2,1),IF(JF10=3,LEFT(JE10,1),\"\")))))","v":""},{"$f":"IF(JF10=7,MID(JE10,6,1),IF(JF10=6,MID(JE10,5,1),IF(JF10=5,MID(JE10,4,1),IF(JF10=4,MID(JE10,3,1),IF(JF10=3,MID(JE10,2,1),\"\")))))","v":""},{"$f":"IF(RIGHT(JE10)=0,\"\",RIGHT(JE10))","v":"8"},{"$f":"IF(B10=\"\",\"\",B10)","v":"400044"},{"$f":"IF(LEN(JN10)=0,\"\",LEN(JN10))","v":6},{"$f":"IF(JO10=8,LEFT(JN10),\"\")","v":""},{"$f":"IF(JO10=8,MID(JN10,2,1),IF(JO10=7,LEFT(JN10),\"\"))","v":""},{"$f":"IF(JO10=8,MID(JN10,3,1),IF(JO10=7,MID(JN10,2,1),IF(JO10=6,LEFT(JN10),\"\")))","v":"4"},{"$f":"IF(JO10=8,MID(JN10,4,1),IF(JO10=7,MID(JN10,3,1),IF(JO10=6,MID(JN10,2,1),IF(JO10=5,LEFT(JN10),\"\"))))","v":"0"},{"$f":"IF(JO10=8,MID(JN10,5,1),IF(JO10=7,MID(JN10,4,1),IF(JO10=6,MID(JN10,3,1),IF(JO10=5,MID(JN10,2,1),IF(JO10=4,LEFT(JN10),\"\")))))","v":"0"},{"$f":"IF(JO10=8,MID(JN10,6,1),IF(JO10=7,MID(JN10,5,1),IF(JO10=6,MID(JN10,4,1),IF(JO10=5,MID(JN10,3,1),IF(JO10=4,MID(JN10,2,1),IF(JO10=3,LEFT(JN10),\"\"))))))","v":"0"},{"$f":"IF(JO10=8,MID(JN10,7,1),IF(JO10=7,MID(JN10,6,1),IF(JO10=6,MID(JN10,5,1),IF(JO10=5,MID(JN10,4,1),IF(JO10=4,MID(JN10,3,1),IF(JO10=3,MID(JN10,2,1),IF(JO10=2,LEFT(JN10),\"\")))))))","v":"4"},{"$f":"IF(RIGHT(JO10)=0,\"\",RIGHT(JN10))","v":"4"},null,null,null,null,null,null,null,null,null,null,null,null,null,null,null,null,null,null,null,null,null,null,null,null,null,null,null,null,null,null,null,null,null,null,null,null,null,null,null,null,null,null,null,null,null,null,null,null,null,null,null,null,null,null,null,null,null,null,null,null,null,null,null,null,null,null,null,null,null,null,null,null,null,null,null,null,null,null,null,null,null,null,null,null,null,null,null,null,null,null,null,null,null,null,null,null,null,null,null,null,null,null,null,null,null,null,null,null,null,null,null,null,null,null,null,null,null,null,null,null,null,null,null,null,null,null,null,null,null,null,null,null,null,null,null,2,3288,null,null,null,null,null,null,null,null,null,"○",null,null,null,null,null,null,null,null,null,null,null,null,null,"○",null,null,null,null,null,null,null,null,null,null,null,null,null,null,null,null,null,null,null,null,null,null,null,null,null,null,null,null,null,null,null,null,null,null,null,null,null,null,null,null,null,null,null,null,null,null,null,null,null,null,null,null,null,null,null,null,null,null,null,null,null,null,null,null,null,null,null,null,null,null,null,null,null,null,null,null,null,null,null,null,null,null,null,null,null,null,null,null,null,null,null,null,null,null,null,null,null,null,null,null,null,null,null,null,null,null,2,3288,null,null,null,null,null,null,null,null,null,"○",null,null,null,null,null,null,null,null,null,null,null,null,null,"○"]
[2,"39402037",null,null,"後期高齢者","本",null,"12711848",2,"S35/04/16","後期花子",null,null,null,"830-0027","久留米市長門石3-11-35",null,"後期花子","コウキハナコ","S35/04/16",null,"腰痛症","R04/02/11  ","原因不詳・経過良好","R04/05/16","継続","S10/04/16",null,null,null,null,null,null,null,3,1,null,null,null,null,null,"腰の痛みは術後、緩解するが数日経つと痛みが徐々に出てくる。",null,"福岡市中央区天神2-3-3","伊藤和子","R04/05/02","女","女","福岡県後期高齢者医療広域連合","被保険者","092-235-3402","継続",null,"○",null,null,null,null,"○",null,null,null,null,null,null,null,null,null,null,null,null,null,null,null,null,null,null,null,null,null,null,null,null,2,"後期花子","","","","","12711848",8,"","","8",2,1,"","","","","","2","S35/04/16","S","35","04","16",1925,1960,"1960-04-16",62,null,null,null,null,null,null,null,null,null,null,null,null,"R04/05/16","R","04","05","16",5,1,31,null,null,null,null,null,0,1,"3","1","R04/02/11  ","04","02","11","R",null,null,0,{"$f":"IF(Z11<>\"新規\",\"\",IF(AI11=3,基本!$E$14,IF(OR(AI11=1,AI11=2),基本!$E$13,\"\")))","v":""},{"$f":"IF(CF11=0,\"\",IF(AI11=3,基本!$E$16*CF11,IF(OR(AI11=1,AI11=2),基本!$E$15*CF11)))","v":3220},{"$f":"IF(AJ11=\"\",\"\",IF(AJ11>0,基本!$E$17*CF11))","v":68},{"$f":"IF(ER11=0,\"\",IF(AM11<=4,基本!$E$18*ER11,IF(AM11>4,基本!$E$19*ER11)))","v":""},{"$f":"IF(AC11=\"\",\"\",IF(AC11>=1,基本!$E$20))","v":""},3288,"","","",3288,"","","",null,null,null,null,null,null,null,null,null,null,null,null,null,null,null,null,null,null,null,null,null,null,null,null,null,null,null,null,null,null,null,null,null,null,null,null,null,null,null,null,null,null,null,null,null,null,null,null,null,null,null,null,null,"R04/05/02","R","04","05","02",5,"",2,"","","","",7,"","","","","","","","","","","","","","","","","","","","","","","","",7,null,null,"","","","","","","","","","","12711848",8,"","","","","","","8","39402037",8,"3","9","4","0","2","0","3","7",null,null,null,null,null,null,null,null,null,null,null,null,null,null,null,null,null,null,null,null,null,null,null,null,null,null,null,null,null,null,null,null,null,null,null,null,null,null,null,null,null,null,null,null,null,null,null,null,null,null,null,null,null,null,null,null,null,null,null,null,null,null,null,null,null,null,null,null,null,null,null,null,null,null,null,null,null,null,null,null,null,null,null,null,null,null,null,null,null,null,null,null,null,null,null,null,null,null,null,null,null,null,null,null,null,null,null,null,null,null,null,null,null,null,null,null,null,null,null,null,null,null,null,null,null,null,null,null,null,null,null,null,null,null,null,2,3288,null,"○",null,null,null,null,"○",null,null,null,null,null,null,null,null,null,null,null,null,null,null,null,null,null,null,null,null,null,null,null,null,null,null,null,null,null,null,null,null,null,null,null,null,null,null,null,null,null,null,null,null,null,null,null,null,null,null,null,null,null,null,null,null,null,null,null,null,null,null,null,null,null,null,null,null,null,null,null,null,null,null,null,null,null,null,null,null,null,null,null,null,null,null,null,null,null,null,null,null,null,null,null,null,null,null,null,null,null,null,null,null,null,null,null,null,null,null,null,null,null,null,null,null,null,null,null,null,null,null,null,2,3288,null,"○",null,null,null,null,"○"]
[3,null,null,null,null,null,null,null,null,null,null,null,null,null,null,null,null,null,null,null,null,null,null,null,null,null,null,null,null,null,null,null,null,null,null,null,null,null,null,null,null,null,null,null,null,null,null,null,null,null,null,"中止",null,null,null,null,null,null,null,null,null,null,null,null,null,null,null,null,null,null,null,null,null,null,null,null,null,null,null,null,null,null,null,0,"","","","","","","","","","","","","","","","","","","","","","","","","","","",{"$f":"LEFT(DG12)","v":""},{"$f":"MID(DG12,2,1)","v":""},{"$f":"MID(DG12,3,1)","v":""},{"$f":"MID(DG12,5,1)","v":""},{"$f":"MID(DG12,6,1)","v":""},{"$f":"MID(DG12,7,1)","v":""},{"$f":"MID(DG12,8,1)","v":""},null,null,null,null,null,"","","","","","","","",null,null,null,null,null,"","","","","","","","","",null,null,0,{"$f":"IF(Z12<>\"新規\",\"\",IF(AI12=3,基本!$E$14,IF(OR(AI12=1,AI12=2),基本!$E$13,\"\")))","v":""},{"$f":"IF(CF12=0,\"\",IF(AI12=3,基本!$E$16*CF12,IF(OR(AI12=1,AI12=2),基本!$E$15*CF12)))","v":""},{"$f":"IF(AJ12=\"\",\"\",IF(AJ12>0,基本!$E$17*CF12))","v":""},{"$f":"IF(ER12=0,\"\",IF(AM12<=4,基本!$E$18*ER12,IF(AM12>4,基本!$E$19*ER12)))","v":""},{"$f":"IF(AC12=\"\",\"\",IF(AC12>=1,基本!$E$20))","v":""},0,"","","","","","","",null,null,null,null,null,null,null,null,null,null,null,null,null,null,null,null,null,null,null,null,null,null,null,null,null,null,null,null,null,null,null,null,null,null,null,null,null,null,null,null,null,null,null,null,null,null,null,null,null,null,null,null,null,"","","","","","","","","","","","","","","","","","","","","","","","","","","","","","","","","","","","","","",null,null,"","","","","","","","","","","","","","","","","","","","","","","","","","","","","",null,null,null,null,null,null,null,null,null,null,null,null,null,null,null,null,null,null,null,null,null,null,null,null,null,null,null,null,null,null,null,null,null,null,null,null,null,null,null,null,null,null,null,null,null,null,null,null,null,null,null,null,null,null,null,null,null,null,null,null,null,null,null,null,null,null,null,null,null,null,null,null,null,null,null,null,null,null,null,null,null,null,null,null,null,null,null,null,null,null,null,null,null,null,null,null,null,null,null,null,null,null,null,null,null,null,null,null,null,null,null,null,null,null,null,null,null,null,null,null,null,null,null,null,null,null,null,null,null,null,null,null,null,null,null,0,0,null,null,null,null,null,null,null,null,null,null,null,null,null,null,null,null,null,null,null,null,null,null,null,null,null,null,null,null,null,null,null,null,null,null,null,null,null,null,null,null,null,null,null,null,null,null,null,null,null,null,null,null,null,null,null,null,null,null,null,null,null,null,null,null,null,null,null,null,null,null,null,null,null,null,null,null,null,null,null,null,null,null,null,null,null,null,null,null,null,null,null,null,null,null,null,null,null,null,null,null,null,null,null,null,null,null,null,null,null,null,null,null,null,null,null,null,null,null,null,null,null,null,null,null,null,null,null,null,null,null,0,0]
[4,null,null,null,null,null,null,null,null,null,null,null,null,null,null,null,null,null,null,null,null,null,null,null,null,null,null,null,null,null,null,null,null,null,null,null,null,null,null,null,null,null,null,null,null,null,null,null,null,null,null,"転医",null,null,null,null,null,null,null,null,null,null,null,null,null,null,null,null,null,null,null,null,null,null,null,null,null,null,null,null,null,null,null,0,"","","","","","","","","","","","","","","","","","","","","","","","","","","","","","","","","","",null,null,null,null,null,"","","","","","","","",null,null,null,null,null,"","","","","","","","","",null,null,0,{"$f":"IF(Z13<>\"新規\",\"\",IF(AI13=3,基本!$E$14,IF(OR(AI13=1,AI13=2),基本!$E$13,\"\")))","v":""},{"$f":"IF(CF13=0,\"\",IF(AI13=3,基本!$E$16*CF13,IF(OR(AI13=1,AI13=2),基本!$E$15*CF13)))","v":""},{"$f":"IF(AJ13=\"\",\"\",IF(AJ13>0,基本!$E$17*CF13))","v":""},{"$f":"IF(ER13=0,\"\",IF(AM13<=4,基本!$E$18*ER13,IF(AM13>4,基本!$E$19*ER13)))","v":""},{"$f":"IF(AC13=\"\",\"\",IF(AC13>=1,基本!$E$20))","v":""},0,"","","","","","","",null,null,null,null,null,null,null,null,null,null,null,null,null,null,null,null,null,null,null,null,null,null,null,null,null,null,null,null,null,null,null,null,null,null,null,null,null,null,null,null,null,null,null,null,null,null,null,null,null,null,null,null,null,"","","","","","","","","","","","","","","","","","","","","","","","","","","","","","","","","","","","","","",null,null,"","","","","","","","","","","","","","","","","","","","","","","","","","","","","",{"$f":"LEFT(IP13,2)","v":""},null,null,null,null,null,null,null,null,null,null,null,null,null,null,null,null,null,null,null,null,null,null,null,null,null,null,null,null,null,null,null,null,null,null,null,null,null,null,null,null,null,null,null,null,null,null,null,null,null,null,null,null,null,null,null,null,null,null,null,null,null,null,null,null,null,null,null,null,null,null,null,null,null,null,null,null,null,null,null,null,null,null,null,null,null,null,null,null,null,null,null,null,null,null,null,null,null,null,null,null,null,null,null,null,null,null,null,null,null,null,null,null,null,null,null,null,null,null,null,null,null,null,null,null,null,null,null,null,null,null,null,null,null,null,0,0,null,null,null,null,null,null,null,null,null,null,null,null,null,null,null,null,null,null,null,null,null,null,null,null,null,null,null,null,null,null,null,null,null,null,null,null,null,null,null,null,null,null,null,null,null,null,null,null,null,null,null,null,null,null,null,null,null,null,null,null,null,null,null,null,null,null,null,null,null,null,null,null,null,null,null,null,null,null,null,null,null,null,null,null,null,null,null,null,null,null,null,null,null,null,null,null,null,null,null,null,null,null,null,null,null,null,null,null,null,null,null,null,null,null,null,null,null,null,null,null,null,null,null,null,null,null,null,null,null,null,0,0]
[5,null,null,null,null,null,null,null,null,null,null,null,null,null,null,null,null,null,null,null,null,null,null,null,null,null,null,null,null,null,null,null,null,null,null,null,null,null,null,null,null,null,null,null,null,null,null,null,null,null,null,null,null,null,null,null,null,null,null,null,null,null,null,null,null,null,null,null,null,null,null,null,null,null,null,null,null,null,null,null,null,null,null,0,"","","","","","","","","","","","","","","","","","","","","","","","","","","","","","","","","","",null,null,null,null,null,"","","","","","","","",null,null,null,null,null,"","","","","","","","","",null,null,0,{"$f":"IF(Z14<>\"新規\",\"\",IF(AI14=3,基本!$E$14,IF(OR(AI14=1,AI14=2),基本!$E$13,\"\")))","v":""},{"$f":"IF(CF14=0,\"\",IF(AI14=3,基本!$E$16*CF14,IF(OR(AI14=1,AI14=2),基本!$E$15*CF14)))","v":""},{"$f":"IF(AJ14=\"\",\"\",IF(AJ14>0,基本!$E$17*CF14))","v":""},{"$f":"IF(ER14=0,\"\",IF(AM14<=4,基本!$E$18*ER14,IF(AM14>4,基本!$E$19*ER14)))","v":""},{"$f":"IF(AC14=\"\",\"\",IF(AC14>=1,基本!$E$20))","v":""},0,"","","","","","","",null,null,null,null,null,null,null,null,null,null,null,null,null,null,null,null,null,null,null,null,null,null,null,null,null,null,null,null,null,null,null,null,null,null,null,null,null,null,null,null,null,null,null,null,null,null,null,null,null,null,null,null,null,"","","","","","","","","","","","","","","","","","","","","","","","","","","","","","","","","","","","","","",null,null,"","","","","","","","","","","","","","","","","","","","","","","","","","","","","",{"$f":"LEFT(IP14,2)","v":""},null,null,null,null,null,null,null,null,null,null,null,null,null,null,null,null,null,null,null,null,null,null,null,null,null,null,null,null,null,null,null,null,null,null,null,null,null,null,null,null,null,null,null,null,null,null,null,null,null,null,null,null,null,null,null,null,null,null,null,null,null,null,null,null,null,null,null,null,null,null,null,null,null,null,null,null,null,null,null,null,null,null,null,null,null,null,null,null,null,null,null,null,null,null,null,null,null,null,null,null,null,null,null,null,null,null,null,null,null,null,null,null,null,null,null,null,null,null,null,null,null,null,null,null,null,null,null,null,null,null,null,null,null,null,0,0,null,null,null,null,null,null,null,null,null,null,null,null,null,null,null,null,null,null,null,null,null,null,null,null,null,null,null,null,null,null,null,null,null,null,null,null,null,null,null,null,null,null,null,null,null,null,null,null,null,null,null,null,null,null,null,null,null,null,null,null,null,null,null,null,null,null,null,null,null,null,null,null,null,null,null,null,null,null,null,null,null,null,null,null,null,null,null,null,null,null,null,null,null,null,null,null,null,null,null,null,null,null,null,null,null,null,null,null,null,null,null,null,null,null,null,null,null,null,null,null,null,null,null,null,null,null,null,null,null,null,0,0]
[6,null,null,null,null,null,null,null,null,null,null,null,null,null,null,null,null,null,null,null,null,null,null,null,null,null,null,null,null,null,null,null,null,null,null,null,null,null,null,null,null,null,null,null,null,null,null,null,null,null,null,null,null,null,null,null,null,null,null,null,null,null,null,null,null,null,null,null,null,null,null,null,null,null,null,null,null,null,null,null,null,null,null,0,"","","","","","","","","","","","","","","","","","","","","","","","","","","","","","","","","","",null,null,null,null,null,"","","","","","","","",null,null,null,null,null,"","","","","","","","","",null,null,0,{"$f":"IF(Z15<>\"新規\",\"\",IF(AI15=3,基本!$E$14,IF(OR(AI15=1,AI15=2),基本!$E$13,\"\")))","v":""},{"$f":"IF(CF15=0,\"\",IF(AI15=3,基本!$E$16*CF15,IF(OR(AI15=1,AI15=2),基本!$E$15*CF15)))","v":""},{"$f":"IF(AJ15=\"\",\"\",IF(AJ15>0,基本!$E$17*CF15))","v":""},{"$f":"IF(ER15=0,\"\",IF(AM15<=4,基本!$E$18*ER15,IF(AM15>4,基本!$E$19*ER15)))","v":""},{"$f":"IF(AC15=\"\",\"\",IF(AC15>=1,基本!$E$20))","v":""},0,"","","","","","","",null,null,null,null,null,null,null,null,null,null,null,null,null,null,null,null,null,null,null,null,null,null,null,null,null,null,null,null,null,null,null,null,null,null,null,null,null,null,null,null,null,null,null,null,null,null,null,null,null,null,null,null,null,"","","","","","","","","","","","","","","","","","","","","","","","","","","","","","","","","","","","","","",null,null,"","","","","","","","","","","","","","","","","","","","","","","","","","","","","",null,null,null,null,null,null,null,null,null,null,null,null,null,null,null,null,null,null,null,null,null,null,null,null,null,null,null,null,null,null,null,null,null,null,null,null,null,null,null,null,null,null,null,null,null,null,null,null,null,null,null,null,null,null,null,null,null,null,null,null,null,null,null,null,null,null,null,null,null,null,null,null,null,null,null,null,null,null,null,null,null,null,null,null,null,null,null,null,null,null,null,null,null,null,null,null,null,null,null,null,null,null,null,null,null,null,null,null,null,null,null,null,null,null,null,null,null,null,null,null,null,null,null,null,null,null,null,null,null,null,null,null,null,null,null,0,0,null,null,null,null,null,null,null,null,null,null,null,null,null,null,null,null,null,null,null,null,null,null,null,null,null,null,null,null,null,null,null,null,null,null,null,null,null,null,null,null,null,null,null,null,null,null,null,null,null,null,null,null,null,null,null,null,null,null,null,null,null,null,null,null,null,null,null,null,null,null,null,null,null,null,null,null,null,null,null,null,null,null,null,null,null,null,null,null,null,null,null,null,null,null,null,null,null,null,null,null,null,null,null,null,null,null,null,null,null,null,null,null,null,null,null,null,null,null,null,null,null,null,null,null,null,null,null,null,null,null,0,0]
[7,null,null,null,null,null,null,null,null,null,null,null,null,null,null,null,null,null,null,null,null,null,null,null,null,null,null,null,null,null,null,null,null,null,null,null,null,null,null,null,null,null,null,null,null,null,null,null,null,null,null,null,null,null,null,null,null,null,null,null,null,null,null,null,null,null,null,null,null,null,null,null,null,null,null,null,null,null,null,null,null,null,null,0,"","","","","","","","","","","","","","","","","","","","","","","","","","","","","","","","","","",null,null,null,null,null,"","","","","","","","",null,null,null,null,null,"","","","","","","","","",null,null,0,{"$f":"IF(Z16<>\"新規\",\"\",IF(AI16=3,基本!$E$14,IF(OR(AI16=1,AI16=2),基本!$E$13,\"\")))","v":""},{"$f":"IF(CF16=0,\"\",IF(AI16=3,基本!$E$16*CF16,IF(OR(AI16=1,AI16=2),基本!$E$15*CF16)))","v":""},{"$f":"IF(AJ16=\"\",\"\",IF(AJ16>0,基本!$E$17*CF16))","v":""},{"$f":"IF(ER16=0,\"\",IF(AM16<=4,基本!$E$18*ER16,IF(AM16>4,基本!$E$19*ER16)))","v":""},{"$f":"IF(AC16=\"\",\"\",IF(AC16>=1,基本!$E$20))","v":""},0,"","","","","","","",null,null,null,null,null,null,null,null,null,null,null,null,null,null,null,null,null,null,null,null,null,null,null,null,null,null,null,null,null,null,null,null,null,null,null,null,null,null,null,null,null,null,null,null,null,null,null,null,null,null,null,null,null,"","","","","","","","","","","","","","","","","","","","","","","","","","","","","","","","","","","","","","",null,null,"","","","","","","","","","","","","","","","","","","","","","","","","","","","","",null,null,null,null,null,null,null,null,null,null,null,null,null,null,null,null,null,null,null,null,null,null,null,null,null,null,null,null,null,null,null,null,null,null,null,null,null,null,null,null,null,null,null,null,null,null,null,null,null,null,null,null,null,null,null,null,null,null,null,null,null,null,null,null,null,null,null,null,null,null,null,null,null,null,null,null,null,null,null,null,null,null,null,null,null,null,null,null,null,null,null,null,null,null,null,null,null,null,null,null,null,null,null,null,null,null,null,null,null,null,null,null,null,null,null,null,null,null,null,null,null,null,null,null,null,null,null,null,null,null,null,null,null,null,null,0,0,null,null,null,null,null,null,null,null,null,null,null,null,null,null,null,null,null,null,null,null,null,null,null,null,null,null,null,null,null,null,null,null,null,null,null,null,null,null,null,null,null,null,null,null,null,null,null,null,null,null,null,null,null,null,null,null,null,null,null,null,null,null,null,null,null,null,null,null,null,null,null,null,null,null,null,null,null,null,null,null,null,null,null,null,null,null,null,null,null,null,null,null,null,null,null,null,null,null,null,null,null,null,null,null,null,null,null,null,null,null,null,null,null,null,null,null,null,null,null,null,null,null,null,null,null,null,null,null,null,null,0,0]
[8,null,null,null,null,null,null,null,null,null,null,null,null,null,null,null,null,null,null,null,null,null,null,null,null,null,null,null,null,null,null,null,null,null,null,null,null,null,null,null,null,null,null,null,null,null,null,null,null,null,null,null,null,null,null,null,null,null,null,null,null,null,null,null,null,null,null,null,null,null,null,null,null,null,null,null,null,null,null,null,null,null,null,0,"","","","","","","","","","","","","","","","","","","","","","","","","","","","","","","","","","",null,null,null,null,null,"","","","","","","","",null,null,null,null,null,"","","","","","","","","",null,null,0,{"$f":"IF(Z17<>\"新規\",\"\",IF(AI17=3,基本!$E$14,IF(OR(AI17=1,AI17=2),基本!$E$13,\"\")))","v":""},{"$f":"IF(CF17=0,\"\",IF(AI17=3,基本!$E$16*CF17,IF(OR(AI17=1,AI17=2),基本!$E$15*CF17)))","v":""},{"$f":"IF(AJ17=\"\",\"\",IF(AJ17>0,基本!$E$17*CF17))","v":""},{"$f":"IF(ER17=0,\"\",IF(AM17<=4,基本!$E$18*ER17,IF(AM17>4,基本!$E$19*ER17)))","v":""},{"$f":"IF(AC17=\"\",\"\",IF(AC17>=1,基本!$E$20))","v":""},0,"","","","","","","",null,null,null,null,null,null,null,null,null,null,null,null,null,null,null,null,null,null,null,null,null,null,null,null,null,null,null,null,null,null,null,null,null,null,null,null,null,null,null,null,null,null,null,null,null,null,null,null,null,null,null,null,null,"","","","","","","","","","","","","","","","","","","","","","","","","","","","","","","","","","","","","","",null,null,"","","","","","","","","","","","","","","","","","","","","","","","","","","","","",null,null,null,null,null,null,null,null,null,null,null,null,null,null,null,null,null,null,null,null,null,null,null,null,null,null,null,null,null,null,null,null,null,null,null,null,null,null,null,null,null,null,null,null,null,null,null,null,null,null,null,null,null,null,null,null,null,null,null,null,null,null,null,null,null,null,null,null,null,null,null,null,null,null,null,null,null,null,null,null,null,null,null,null,null,null,null,null,null,null,null,null,null,null,null,null,null,null,null,null,null,null,null,null,null,null,null,null,null,null,null,null,null,null,null,null,null,null,null,null,null,null,null,null,null,null,null,null,null,null,null,null,null,null,null,0,0,null,null,null,null,null,null,null,null,null,null,null,null,null,null,null,null,null,null,null,null,null,null,null,null,null,null,null,null,null,null,null,null,null,null,null,null,null,null,null,null,null,null,null,null,null,null,null,null,null,null,null,null,null,null,null,null,null,null,null,null,null,null,null,null,null,null,null,null,null,null,null,null,null,null,null,null,null,null,null,null,null,null,null,null,null,null,null,null,null,null,null,null,null,null,null,null,null,null,null,null,null,null,null,null,null,null,null,null,null,null,null,null,null,null,null,null,null,null,null,null,null,null,null,null,null,null,null,null,null,null,0,0]
[9,null,null,null,null,null,null,null,null,null,null,null,null,null,null,null,null,null,null,null,null,null,null,null,null,null,null,null,null,null,null,null,null,null,null,null,null,null,null,null,null,null,null,null,null,null,null,null,null,null,null,null,null,null,null,null,null,null,null,null,null,null,null,null,null,null,null,null,null,null,null,null,null,null,null,null,null,null,null,null,null,null,null,0,"","","","","","","","","","","","","","","","","","","","","","","","","","","","","","","","","","",null,null,null,null,null,"","","","","","","","",null,null,null,null,null,"","","","","","","","","",null,null,0,{"$f":"IF(Z18<>\"新規\",\"\",IF(AI18=3,基本!$E$14,IF(OR(AI18=1,AI18=2),基本!$E$13,\"\")))","v":""},{"$f":"IF(CF18=0,\"\",IF(AI18=3,基本!$E$16*CF18,IF(OR(AI18=1,AI18=2),基本!$E$15*CF18)))","v":""},{"$f":"IF(AJ18=\"\",\"\",IF(AJ18>0,基本!$E$17*CF18))","v":""},{"$f":"IF(ER18=0,\"\",IF(AM18<=4,基本!$E$18*ER18,IF(AM18>4,基本!$E$19*ER18)))","v":""},{"$f":"IF(AC18=\"\",\"\",IF(AC18>=1,基本!$E$20))","v":""},0,"","","","","","","",null,null,null,null,null,null,null,null,null,null,null,null,null,null,null,null,null,null,null,null,null,null,null,null,null,null,null,null,null,null,null,null,null,null,null,null,null,null,null,null,null,null,null,null,null,null,null,null,null,null,null,null,null,"","","","","","","","","","","","","","","","","","","","","","","","","","","","","","","","","","","","","","",null,null,"","","","","","","","","","","","","","","","","","","","","","","","","","","","","",null,null,null,null,null,null,null,null,null,null,null,null,null,null,null,null,null,null,null,null,null,null,null,null,null,null,null,null,null,null,null,null,null,null,null,null,null,null,null,null,null,null,null,null,null,null,null,null,null,null,null,null,null,null,null,null,null,null,null,null,null,null,null,null,null,null,null,null,null,null,null,null,null,null,null,null,null,null,null,null,null,null,null,null,null,null,null,null,null,null,null,null,null,null,null,null,null,null,null,null,null,null,null,null,null,null,null,null,null,null,null,null,null,null,null,null,null,null,null,null,null,null,null,null,null,null,null,null,null,null,null,null,null,null,null,0,0,null,null,null,null,null,null,null,null,null,null,null,null,null,null,null,null,null,null,null,null,null,null,null,null,null,null,null,null,null,null,null,null,null,null,null,null,null,null,null,null,null,null,null,null,null,null,null,null,null,null,null,null,null,null,null,null,null,null,null,null,null,null,null,null,null,null,null,null,null,null,null,null,null,null,null,null,null,null,null,null,null,null,null,null,null,null,null,null,null,null,null,null,null,null,null,null,null,null,null,null,null,null,null,null,null,null,null,null,null,null,null,null,null,null,null,null,null,null,null,null,null,null,null,null,null,null,null,null,null,null,0,0]
[10,null,null,null,null,null,null,null,null,null,null,null,null,null,null,null,null,null,null,null,null,null,null,null,null,null,{"$f":"IF(LEFT(V19,3)=\"神経痛\",1,IF(LEFT(V19,3)=\"リウマ\",2,IF(LEFT(V19,3)=\"頚腕症\",3,IF(LEFT(V19,3)=\"五十肩\",4,IF(LEFT(V19,3)=\"腰痛症\",5,IF(LEFT(V19,3)=\"頚椎捻\",6,\"\"))))))","v":""},null,null,null,null,null,null,null,null,null,null,null,null,null,null,null,null,null,null,null,null,null,null,null,null,null,null,null,null,null,null,null,null,null,null,null,null,null,null,null,null,null,null,null,null,null,null,null,null,null,null,null,null,null,null,null,null,0,"","","","","","","","","","","","","","","","","","","","","","","","","","","","","","","","","","",null,null,null,null,null,"","","","","","","","",null,null,null,null,null,"","","","","","","","","",null,null,0,{"$f":"IF(Z19<>\"新規\",\"\",IF(AI19=3,基本!$E$14,IF(OR(AI19=1,AI19=2),基本!$E$13,\"\")))","v":""},{"$f":"IF(CF19=0,\"\",IF(AI19=3,基本!$E$16*CF19,IF(OR(AI19=1,AI19=2),基本!$E$15*CF19)))","v":""},{"$f":"IF(AJ19=\"\",\"\",IF(AJ19>0,基本!$E$17*CF19))","v":""},{"$f":"IF(ER19=0,\"\",IF(AM19<=4,基本!$E$18*ER19,IF(AM19>4,基本!$E$19*ER19)))","v":""},{"$f":"IF(AC19=\"\",\"\",IF(AC19>=1,基本!$E$20))","v":""},0,"","","","","","","",null,null,null,null,null,null,null,null,null,null,null,null,null,null,null,null,null,null,null,null,null,null,null,null,null,null,null,null,null,null,null,null,null,null,null,null,null,null,null,null,null,null,null,null,null,null,null,null,null,null,null,null,null,"","","","","","","","","","","","","","","","","","","","","","","","","","","","","","","","","","","","","","",null,null,"","","","","","","","","","","","","","","","","","","","","","","","","","","","","",null,null,null,null,null,null,null,null,null,null,null,null,null,null,null,null,null,null,null,null,null,null,null,null,null,null,null,null,null,null,null,null,null,null,null,null,null,null,null,null,null,null,null,null,null,null,null,null,null,null,null,null,null,null,null,null,null,null,null,null,null,null,null,null,null,null,null,null,null,null,null,null,null,null,null,null,null,null,null,null,null,null,null,null,null,null,null,null,null,null,null,null,null,null,null,null,null,null,null,null,null,null,null,null,null,null,null,null,null,null,null,null,null,null,null,null,null,null,null,null,null,null,null,null,null,null,null,null,null,null,null,null,null,null,null,0,0,null,null,null,null,null,null,null,null,null,null,null,null,null,null,null,null,null,null,null,null,null,null,null,null,null,null,null,null,null,null,null,null,null,null,null,null,null,null,null,null,null,null,null,null,null,null,null,null,null,null,null,null,null,null,null,null,null,null,null,null,null,null,null,null,null,null,null,null,null,null,null,null,null,null,null,null,null,null,null,null,null,null,null,null,null,null,null,null,null,null,null,null,null,null,null,null,null,null,null,null,null,null,null,null,null,null,null,null,null,null,null,null,null,null,null,null,null,null,null,null,null,null,null,null,null,null,null,null,null,null,0,0]
[11,null,null,null,null,null,null,null,null,null,null,null,null,null,null,null,null,null,null,null,null,null,null,null,null,null,"",null,null,null,null,null,null,null,null,null,null,null,null,null,null,null,null,null,null,null,null,null,null,null,null,null,null,null,null,null,null,null,null,null,null,null,null,null,null,null,null,null,null,null,null,null,null,null,null,null,null,null,null,null,null,null,null,0,"","","","","","","","","","","","","","","","","","","","","","","","","","","","","","","","","","",null,null,null,null,null,"","","","","","","","",null,null,null,null,null,"","","","","","","","","",null,null,0,{"$f":"IF(Z20<>\"新規\",\"\",IF(AI20=3,基本!$E$14,IF(OR(AI20=1,AI20=2),基本!$E$13,\"\")))","v":""},{"$f":"IF(CF20=0,\"\",IF(AI20=3,基本!$E$16*CF20,IF(OR(AI20=1,AI20=2),基本!$E$15*CF20)))","v":""},{"$f":"IF(AJ20=\"\",\"\",IF(AJ20>0,基本!$E$17*CF20))","v":""},{"$f":"IF(ER20=0,\"\",IF(AM20<=4,基本!$E$18*ER20,IF(AM20>4,基本!$E$19*ER20)))","v":""},{"$f":"IF(AC20=\"\",\"\",IF(AC20>=1,基本!$E$20))","v":""},0,"","","","","","","",null,null,null,null,null,null,null,null,null,null,null,null,null,null,null,null,null,null,null,null,null,null,null,null,null,null,null,null,null,null,null,null,null,null,null,null,null,null,null,null,null,null,null,null,null,null,null,null,null,null,null,null,null,"","","","","","","","","","","","","","","","","","","","","","","","","","","","","","","","","","","","","","",null,null,"","","","","","","","","","","","","","","","","","","","","","","","","","","","","",null,null,null,null,null,null,null,null,null,null,null,null,null,null,null,null,null,null,null,null,null,null,null,null,null,null,null,null,null,null,null,null,null,null,null,null,null,null,null,null,null,null,null,null,null,null,null,null,null,null,null,null,null,null,null,null,null,null,null,null,null,null,null,null,null,null,null,null,null,null,null,null,null,null,null,null,null,null,null,null,null,null,null,null,null,null,null,null,null,null,null,null,null,null,null,null,null,null,null,null,null,null,null,null,null,null,null,null,null,null,null,null,null,null,null,null,null,null,null,null,null,null,null,null,null,null,null,null,null,null,null,null,null,null,null,0,0,null,null,null,null,null,null,null,null,null,null,null,null,null,null,null,null,null,null,null,null,null,null,null,null,null,null,null,null,null,null,null,null,null,null,null,null,null,null,null,null,null,null,null,null,null,null,null,null,null,null,null,null,null,null,null,null,null,null,null,null,null,null,null,null,null,null,null,null,null,null,null,null,null,null,null,null,null,null,null,null,null,null,null,null,null,null,null,null,null,null,null,null,null,null,null,null,null,null,null,null,null,null,null,null,null,null,null,null,null,null,null,null,null,null,null,null,null,null,null,null,null,null,null,null,null,null,null,null,null,null,0,0]
[12,null,null,null,null,null,null,null,null,null,null,null,null,null,null,null,null,null,null,null,null,null,null,null,null,null,"",null,null,null,null,null,null,null,null,null,null,null,null,null,null,null,null,null,null,null,null,null,null,null,null,null,null,null,null,null,null,null,null,null,null,null,null,null,null,null,null,null,null,null,null,null,null,null,null,null,null,null,null,null,null,null,null,0,"","","","","","","","","","","","","","","","","","","","","","","","","","","","","","","","","","",null,null,null,null,null,"","","","","","","","",null,null,null,null,null,"","","","","","","","","",null,null,0,{"$f":"IF(Z21<>\"新規\",\"\",IF(AI21=3,基本!$E$14,IF(OR(AI21=1,AI21=2),基本!$E$13,\"\")))","v":""},{"$f":"IF(CF21=0,\"\",IF(AI21=3,基本!$E$16*CF21,IF(OR(AI21=1,AI21=2),基本!$E$15*CF21)))","v":""},{"$f":"IF(AJ21=\"\",\"\",IF(AJ21>0,基本!$E$17*CF21))","v":""},{"$f":"IF(ER21=0,\"\",IF(AM21<=4,基本!$E$18*ER21,IF(AM21>4,基本!$E$19*ER21)))","v":""},{"$f":"IF(AC21=\"\",\"\",IF(AC21>=1,基本!$E$20))","v":""},0,"","","","","","","",null,null,null,null,null,null,null,null,null,null,null,null,null,null,null,null,null,null,null,null,null,null,null,null,null,null,null,null,null,null,null,null,null,null,null,null,null,null,null,null,null,null,null,null,null,null,null,null,null,null,null,null,null,"","","","","","","","","","","","","","","","","","","","","","","","","","","","","","","","","","","","","","",null,null,"","","","","","","","","","","","","","","","","","","","","","","","","","","","","",null,null,null,null,null,null,null,null,null,null,null,null,null,null,null,null,null,null,null,null,null,null,null,null,null,null,null,null,null,null,null,null,null,null,null,null,null,null,null,null,null,null,null,null,null,null,null,null,null,null,null,null,null,null,null,null,null,null,null,null,null,null,null,null,null,null,null,null,null,null,null,null,null,null,null,null,null,null,null,null,null,null,null,null,null,null,null,null,null,null,null,null,null,null,null,null,null,null,null,null,null,null,null,null,null,null,null,null,null,null,null,null,null,null,null,null,null,null,null,null,null,null,null,null,null,null,null,null,null,null,null,null,null,null,null,0,0,null,null,null,null,null,null,null,null,null,null,null,null,null,null,null,null,null,null,null,null,null,null,null,null,null,null,null,null,null,null,null,null,null,null,null,null,null,null,null,null,null,null,null,null,null,null,null,null,null,null,null,null,null,null,null,null,null,null,null,null,null,null,null,null,null,null,null,null,null,null,null,null,null,null,null,null,null,null,null,null,null,null,null,null,null,null,null,null,null,null,null,null,null,null,null,null,null,null,null,null,null,null,null,null,null,null,null,null,null,null,null,null,null,null,null,null,null,null,null,null,null,null,null,null,null,null,null,null,null,null,0,0]
[13,null,null,null,null,null,null,null,null,null,null,null,null,null,null,null,null,null,null,null,null,null,null,null,null,null,"",null,null,null,null,null,null,null,null,null,null,null,null,null,null,null,null,null,null,null,null,null,null,null,null,null,null,null,null,null,null,null,null,null,null,null,null,null,null,null,null,null,null,null,null,null,null,null,null,null,null,null,null,null,null,null,null,0,"","","","","","","","","","","","","","","","","","","","","","","","","","","","","","","","","","",null,null,null,null,null,"","","","","","","","",null,null,null,null,null,"","","","","","","","","",null,null,0,{"$f":"IF(Z22<>\"新規\",\"\",IF(AI22=3,基本!$E$14,IF(OR(AI22=1,AI22=2),基本!$E$13,\"\")))","v":""},{"$f":"IF(CF22=0,\"\",IF(AI22=3,基本!$E$16*CF22,IF(OR(AI22=1,AI22=2),基本!$E$15*CF22)))","v":""},{"$f":"IF(AJ22=\"\",\"\",IF(AJ22>0,基本!$E$17*CF22))","v":""},{"$f":"IF(ER22=0,\"\",IF(AM22<=4,基本!$E$18*ER22,IF(AM22>4,基本!$E$19*ER22)))","v":""},{"$f":"IF(AC22=\"\",\"\",IF(AC22>=1,基本!$E$20))","v":""},0,"","","","","","","",null,null,null,null,null,null,null,null,null,null,null,null,null,null,null,null,null,null,null,null,null,null,null,null,null,null,null,null,null,null,null,null,null,null,null,null,null,null,null,null,null,null,null,null,null,null,null,null,null,null,null,null,null,"","","","","","","","","","","","","","","","","","","","","","","","","","","","","","","","","","","","","","",null,null,"","","","","","","","","","","","","","","","","","","","","","","","","","","","","",null,null,null,null,null,null,null,null,null,null,null,null,null,null,null,null,null,null,null,null,null,null,null,null,null,null,null,null,null,null,null,null,null,null,null,null,null,null,null,null,null,null,null,null,null,null,null,null,null,null,null,null,null,null,null,null,null,null,null,null,null,null,null,null,null,null,null,null,null,null,null,null,null,null,null,null,null,null,null,null,null,null,null,null,null,null,null,null,null,null,null,null,null,null,null,null,null,null,null,null,null,null,null,null,null,null,null,null,null,null,null,null,null,null,null,null,null,null,null,null,null,null,null,null,null,null,null,null,null,null,null,null,null,null,null,0,0,null,null,null,null,null,null,null,null,null,null,null,null,null,null,null,null,null,null,null,null,null,null,null,null,null,null,null,null,null,null,null,null,null,null,null,null,null,null,null,null,null,null,null,null,null,null,null,null,null,null,null,null,null,null,null,null,null,null,null,null,null,null,null,null,null,null,null,null,null,null,null,null,null,null,null,null,null,null,null,null,null,null,null,null,null,null,null,null,null,null,null,null,null,null,null,null,null,null,null,null,null,null,null,null,null,null,null,null,null,null,null,null,null,null,null,null,null,null,null,null,null,null,null,null,null,null,null,null,null,null,0,0]
[14,null,null,null,null,null,null,null,null,null,null,null,null,null,null,null,null,null,null,null,null,null,null,null,null,null,"",null,null,null,null,null,null,null,null,null,null,null,null,null,null,null,null,null,null,null,null,null,null,null,null,null,null,null,null,null,null,null,null,null,null,null,null,null,null,null,null,null,null,null,null,null,null,null,null,null,null,null,null,null,null,null,null,0,"","","","","","","","","","","","","","","","","","","","","","","","","","","","","","","","","","",null,null,null,null,null,"","","","","","","","",null,null,null,null,null,"","","","","","","","","",null,null,0,{"$f":"IF(Z23<>\"新規\",\"\",IF(AI23=3,基本!$E$14,IF(OR(AI23=1,AI23=2),基本!$E$13,\"\")))","v":""},{"$f":"IF(CF23=0,\"\",IF(AI23=3,基本!$E$16*CF23,IF(OR(AI23=1,AI23=2),基本!$E$15*CF23)))","v":""},{"$f":"IF(AJ23=\"\",\"\",IF(AJ23>0,基本!$E$17*CF23))","v":""},{"$f":"IF(ER23=0,\"\",IF(AM23<=4,基本!$E$18*ER23,IF(AM23>4,基本!$E$19*ER23)))","v":""},{"$f":"IF(AC23=\"\",\"\",IF(AC23>=1,基本!$E$20))","v":""},0,"","","","","","","",null,null,null,null,null,null,null,null,null,null,null,null,null,null,null,null,null,null,null,null,null,null,null,null,null,null,null,null,null,null,null,null,null,null,null,null,null,null,null,null,null,null,null,null,null,null,null,null,null,null,null,null,null,"","","","","","","","","","","","","","","","","","","","","","","","","","","","","","","","","","","","","","",null,null,"","","","","","","","","","","","","","","","","","","","","","","","","","","","","",null,null,null,null,null,null,null,null,null,null,null,null,null,null,null,null,null,null,null,null,null,null,null,null,null,null,null,null,null,null,null,null,null,null,null,null,null,null,null,null,null,null,null,null,null,null,null,null,null,null,null,null,null,null,null,null,null,null,null,null,null,null,null,null,null,null,null,null,null,null,null,null,null,null,null,null,null,null,null,null,null,null,null,null,null,null,null,null,null,null,null,null,null,null,null,null,null,null,null,null,null,null,null,null,null,null,null,null,null,null,null,null,null,null,null,null,null,null,null,null,null,null,null,null,null,null,null,null,null,null,null,null,null,null,null,0,0,null,null,null,null,null,null,null,null,null,null,null,null,null,null,null,null,null,null,null,null,null,null,null,null,null,null,null,null,null,null,null,null,null,null,null,null,null,null,null,null,null,null,null,null,null,null,null,null,null,null,null,null,null,null,null,null,null,null,null,null,null,null,null,null,null,null,null,null,null,null,null,null,null,null,null,null,null,null,null,null,null,null,null,null,null,null,null,null,null,null,null,null,null,null,null,null,null,null,null,null,null,null,null,null,null,null,null,null,null,null,null,null,null,null,null,null,null,null,null,null,null,null,null,null,null,null,null,null,null,null,0,0]
[15,null,null,null,null,null,null,null,null,null,null,null,null,null,null,null,null,null,null,null,null,null,null,null,null,null,"",null,null,null,null,null,null,null,null,null,null,null,null,null,null,null,null,null,null,null,null,null,null,null,null,null,null,null,null,null,null,null,null,null,null,null,null,null,null,null,null,null,null,null,null,null,null,null,null,null,null,null,null,null,null,null,null,0,"","","","","","","","","","","","","","","","","","","","","","","","","","","","","","","","","","",null,null,null,null,null,"","","","","","","","",null,null,null,null,null,"","","","","","","","","",null,null,0,{"$f":"IF(Z24<>\"新規\",\"\",IF(AI24=3,基本!$E$14,IF(OR(AI24=1,AI24=2),基本!$E$13,\"\")))","v":""},{"$f":"IF(CF24=0,\"\",IF(AI24=3,基本!$E$16*CF24,IF(OR(AI24=1,AI24=2),基本!$E$15*CF24)))","v":""},{"$f":"IF(AJ24=\"\",\"\",IF(AJ24>0,基本!$E$17*CF24))","v":""},{"$f":"IF(ER24=0,\"\",IF(AM24<=4,基本!$E$18*ER24,IF(AM24>4,基本!$E$19*ER24)))","v":""},{"$f":"IF(AC24=\"\",\"\",IF(AC24>=1,基本!$E$20))","v":""},0,"","","","","","","",null,null,null,null,null,null,null,null,null,null,null,null,null,null,null,null,null,null,null,null,null,null,null,null,null,null,null,null,null,null,null,null,null,null,null,null,null,null,null,null,null,null,null,null,null,null,null,null,null,null,null,null,null,"","","","","","","","","","","","","","","","","","","","","","","","","","","","","","","","","","","","","","",null,null,"","","","","","","","","","","","","","","","","","","","","","","","","","","","","",null,null,null,null,null,null,null,null,null,null,null,null,null,null,null,null,null,null,null,null,null,null,null,null,null,null,null,null,null,null,null,null,null,null,null,null,null,null,null,null,null,null,null,null,null,null,null,null,null,null,null,null,null,null,null,null,null,null,null,null,null,null,null,null,null,null,null,null,null,null,null,null,null,null,null,null,null,null,null,null,null,null,null,null,null,null,null,null,null,null,null,null,null,null,null,null,null,null,null,null,null,null,null,null,null,null,null,null,null,null,null,null,null,null,null,null,null,null,null,null,null,null,null,null,null,null,null,null,null,null,null,null,null,null,null,0,0,null,null,null,null,null,null,null,null,null,null,null,null,null,null,null,null,null,null,null,null,null,null,null,null,null,null,null,null,null,null,null,null,null,null,null,null,null,null,null,null,null,null,null,null,null,null,null,null,null,null,null,null,null,null,null,null,null,null,null,null,null,null,null,null,null,null,null,null,null,null,null,null,null,null,null,null,null,null,null,null,null,null,null,null,null,null,null,null,null,null,null,null,null,null,null,null,null,null,null,null,null,null,null,null,null,null,null,null,null,null,null,null,null,null,null,null,null,null,null,null,null,null,null,null,null,null,null,null,null,null,0,0]
[16,null,null,null,null,null,null,null,null,null,null,null,null,null,null,null,null,null,null,null,null,null,null,null,null,null,"",null,null,null,null,null,null,null,null,null,null,null,null,null,null,null,null,null,null,null,null,null,null,null,null,null,null,null,null,null,null,null,null,null,null,null,null,null,null,null,null,null,null,null,null,null,null,null,null,null,null,null,null,null,null,null,null,0,"","","","","","","","","","","","","","","","","","","","","","","","","","","","","","","","","","",null,null,null,null,null,"","","","","","","","",null,null,null,null,null,"","","","","","","","","",null,null,0,{"$f":"IF(Z25<>\"新規\",\"\",IF(AI25=3,基本!$E$14,IF(OR(AI25=1,AI25=2),基本!$E$13,\"\")))","v":""},{"$f":"IF(CF25=0,\"\",IF(AI25=3,基本!$E$16*CF25,IF(OR(AI25=1,AI25=2),基本!$E$15*CF25)))","v":""},{"$f":"IF(AJ25=\"\",\"\",IF(AJ25>0,基本!$E$17*CF25))","v":""},{"$f":"IF(ER25=0,\"\",IF(AM25<=4,基本!$E$18*ER25,IF(AM25>4,基本!$E$19*ER25)))","v":""},{"$f":"IF(AC25=\"\",\"\",IF(AC25>=1,基本!$E$20))","v":""},0,"","","","","","","",null,null,null,null,null,null,null,null,null,null,null,null,null,null,null,null,null,null,null,null,null,null,null,null,null,null,null,null,null,null,null,null,null,null,null,null,null,null,null,null,null,null,null,null,null,null,null,null,null,null,null,null,null,"","","","","","","","","","","","","","","","","","","","","","","","","","","","","","","","","","","","","","",null,null,"","","","","","","","","","","","","","","","","","","","","","","","","","","","","",null,null,null,null,null,null,null,null,null,null,null,null,null,null,null,null,null,null,null,null,null,null,null,null,null,null,null,null,null,null,null,null,null,null,null,null,null,null,null,null,null,null,null,null,null,null,null,null,null,null,null,null,null,null,null,null,null,null,null,null,null,null,null,null,null,null,null,null,null,null,null,null,null,null,null,null,null,null,null,null,null,null,null,null,null,null,null,null,null,null,null,null,null,null,null,null,null,null,null,null,null,null,null,null,null,null,null,null,null,null,null,null,null,null,null,null,null,null,null,null,null,null,null,null,null,null,null,null,null,null,null,null,null,null,null,0,0,null,null,null,null,null,null,null,null,null,null,null,null,null,null,null,null,null,null,null,null,null,null,null,null,null,null,null,null,null,null,null,null,null,null,null,null,null,null,null,null,null,null,null,null,null,null,null,null,null,null,null,null,null,null,null,null,null,null,null,null,null,null,null,null,null,null,null,null,null,null,null,null,null,null,null,null,null,null,null,null,null,null,null,null,null,null,null,null,null,null,null,null,null,null,null,null,null,null,null,null,null,null,null,null,null,null,null,null,null,null,null,null,null,null,null,null,null,null,null,null,null,null,null,null,null,null,null,null,null,null,0,0]
[17,null,null,null,null,null,null,null,null,null,null,null,null,null,null,null,null,null,null,null,null,null,null,null,null,null,"S10/04/16",null,null,null,null,null,null,null,null,null,null,null,null,null,null,null,null,null,null,null,null,null,null,null,null,null,null,null,null,null,null,null,null,null,null,null,null,null,null,null,null,null,null,null,null,null,null,null,null,null,null,null,null,null,null,null,null,0,"","","","","","","","","","","","","","","","","","","","","","","","","","","","","","","","","","",null,null,null,null,null,"","","","","","","","",null,null,null,null,null,"","","","","","","","","",null,null,0,{"$f":"IF(Z26<>\"新規\",\"\",IF(AI26=3,基本!$E$14,IF(OR(AI26=1,AI26=2),基本!$E$13,\"\")))","v":""},{"$f":"IF(CF26=0,\"\",IF(AI26=3,基本!$E$16*CF26,IF(OR(AI26=1,AI26=2),基本!$E$15*CF26)))","v":""},{"$f":"IF(AJ26=\"\",\"\",IF(AJ26>0,基本!$E$17*CF26))","v":""},{"$f":"IF(ER26=0,\"\",IF(AM26<=4,基本!$E$18*ER26,IF(AM26>4,基本!$E$19*ER26)))","v":""},{"$f":"IF(AC26=\"\",\"\",IF(AC26>=1,基本!$E$20))","v":""},0,"","","","","","","",null,null,null,null,null,null,null,null,null,null,null,null,null,null,null,null,null,null,null,null,null,null,null,null,null,null,null,null,null,null,null,null,null,null,null,null,null,null,null,null,null,null,null,null,null,null,null,null,null,null,null,null,null,"","","","","","","","","","","","","","","","","","","","","","","","","","","","","","","","","","","","","","",null,null,"","","","","","","","","","","","","","","","","","","","","","","","","","","","","",null,null,null,null,null,null,null,null,null,null,null,null,null,null,null,null,null,null,null,null,null,null,null,null,null,null,null,null,null,null,null,null,null,null,null,null,null,null,null,null,null,null,null,null,null,null,null,null,null,null,null,null,null,null,null,null,null,null,null,null,null,null,null,null,null,null,null,null,null,null,null,null,null,null,null,null,null,null,null,null,null,null,null,null,null,null,null,null,null,null,null,null,null,null,null,null,null,null,null,null,null,null,null,null,null,null,null,null,null,null,null,null,null,null,null,null,null,null,null,null,null,null,null,null,null,null,null,null,null,null,null,null,null,null,null,0,0,null,null,null,null,null,null,null,null,null,null,null,null,null,null,null,null,null,null,null,null,null,null,null,null,null,null,null,null,null,null,null,null,null,null,null,null,null,null,null,null,null,null,null,null,null,null,null,null,null,null,null,null,null,null,null,null,null,null,null,null,null,null,null,null,null,null,null,null,null,null,null,null,null,null,null,null,null,null,null,null,null,null,null,null,null,null,null,null,null,null,null,null,null,null,null,null,null,null,null,null,null,null,null,null,null,null,null,null,null,null,null,null,null,null,null,null,null,null,null,null,null,null,null,null,null,null,null,null,null,null,0,0]
[18,null,null,null,null,null,null,null,null,null,null,null,null,null,null,null,null,null,null,null,null,null,null,null,null,null,"S10/04/16",null,null,null,null,null,null,null,null,null,null,null,null,null,null,null,null,null,null,null,null,null,null,null,null,null,null,null,null,null,null,null,null,null,null,null,null,null,null,null,null,null,null,null,null,null,null,null,null,null,null,null,null,null,null,null,null,0,"","","","","","","","","","","","","","","","","","","","","","","","","","","","","","","","","","",null,null,null,null,null,"","","","","","","","",null,null,null,null,null,"","","","","","","","","",null,null,0,{"$f":"IF(Z27<>\"新規\",\"\",IF(AI27=3,基本!$E$14,IF(OR(AI27=1,AI27=2),基本!$E$13,\"\")))","v":""},{"$f":"IF(CF27=0,\"\",IF(AI27=3,基本!$E$16*CF27,IF(OR(AI27=1,AI27=2),基本!$E$15*CF27)))","v":""},{"$f":"IF(AJ27=\"\",\"\",IF(AJ27>0,基本!$E$17*CF27))","v":""},{"$f":"IF(ER27=0,\"\",IF(AM27<=4,基本!$E$18*ER27,IF(AM27>4,基本!$E$19*ER27)))","v":""},{"$f":"IF(AC27=\"\",\"\",IF(AC27>=1,基本!$E$20))","v":""},0,"","","","","","","",null,null,null,null,null,null,null,null,null,null,null,null,null,null,null,null,null,null,null,null,null,null,null,null,null,null,null,null,null,null,null,null,null,null,null,null,null,null,null,null,null,null,null,null,null,null,null,null,null,null,null,null,null,"","","","","","","","","","","","","","","","","","","","","","","","","","","","","","","","","","","","","","",null,null,"","","","","","","","","","","","","","","","","","","","","","","","","","","","","",null,null,null,null,null,null,null,null,null,null,null,null,null,null,null,null,null,null,null,null,null,null,null,null,null,null,null,null,null,null,null,null,null,null,null,null,null,null,null,null,null,null,null,null,null,null,null,null,null,null,null,null,null,null,null,null,null,null,null,null,null,null,null,null,null,null,null,null,null,null,null,null,null,null,null,null,null,null,null,null,null,null,null,null,null,null,null,null,null,null,null,null,null,null,null,null,null,null,null,null,null,null,null,null,null,null,null,null,null,null,null,null,null,null,null,null,null,null,null,null,null,null,null,null,null,null,null,null,null,null,null,null,null,null,null,0,0,null,null,null,null,null,null,null,null,null,null,null,null,null,null,null,null,null,null,null,null,null,null,null,null,null,null,null,null,null,null,null,null,null,null,null,null,null,null,null,null,null,null,null,null,null,null,null,null,null,null,null,null,null,null,null,null,null,null,null,null,null,null,null,null,null,null,null,null,null,null,null,null,null,null,null,null,null,null,null,null,null,null,null,null,null,null,null,null,null,null,null,null,null,null,null,null,null,null,null,null,null,null,null,null,null,null,null,null,null,null,null,null,null,null,null,null,null,null,null,null,null,null,null,null,null,null,null,null,null,null,0,0]
[19,null,null,null,null,null,null,null,null,null,null,null,null,null,null,null,null,null,null,null,null,null,null,null,null,null,{"$f":"IF(LEFT(V28,3)=\"神経痛\",1,IF(LEFT(V28,3)=\"リウマ\",2,IF(LEFT(V28,3)=\"頚腕症\",3,IF(LEFT(V28,3)=\"五十肩\",4,IF(LEFT(V28,3)=\"腰痛症\",5,IF(LEFT(V28,3)=\"頚椎捻\",6,\"\"))))))","v":""},null,null,null,null,null,null,null,null,null,null,null,null,null,null,null,null,null,null,null,null,null,null,null,null,null,null,null,null,null,null,null,null,null,null,null,null,null,null,null,null,null,null,null,null,null,null,null,null,null,null,null,null,null,null,null,null,0,"","","","","","","","","","","","","","","","","","","","","","","","","","","","","","","","","","",null,null,null,null,null,"","","","","","","","",null,null,null,null,null,"","","","","","","","","",null,null,0,{"$f":"IF(Z28<>\"新規\",\"\",IF(AI28=3,基本!$E$14,IF(OR(AI28=1,AI28=2),基本!$E$13,\"\")))","v":""},{"$f":"IF(CF28=0,\"\",IF(AI28=3,基本!$E$16*CF28,IF(OR(AI28=1,AI28=2),基本!$E$15*CF28)))","v":""},{"$f":"IF(AJ28=\"\",\"\",IF(AJ28>0,基本!$E$17*CF28))","v":""},{"$f":"IF(ER28=0,\"\",IF(AM28<=4,基本!$E$18*ER28,IF(AM28>4,基本!$E$19*ER28)))","v":""},{"$f":"IF(AC28=\"\",\"\",IF(AC28>=1,基本!$E$20))","v":""},0,"","","","","","","",null,null,null,null,null,null,null,null,null,null,null,null,null,null,null,null,null,null,null,null,null,null,null,null,null,null,null,null,null,null,null,null,null,null,null,null,null,null,null,null,null,null,null,null,null,null,null,null,null,null,null,null,null,"","","","","","","","","","","","","","","","","","","","","","","","","","","","","","","","","","","","","","",null,null,"","","","","","","","","","","","","","","","","","","","","","","","","","","","","",null,null,null,null,null,null,null,null,null,null,null,null,null,null,null,null,null,null,null,null,null,null,null,null,null,null,null,null,null,null,null,null,null,null,null,null,null,null,null,null,null,null,null,null,null,null,null,null,null,null,null,null,null,null,null,null,null,null,null,null,null,null,null,null,null,null,null,null,null,null,null,null,null,null,null,null,null,null,null,null,null,null,null,null,null,null,null,null,null,null,null,null,null,null,null,null,null,null,null,null,null,null,null,null,null,null,null,null,null,null,null,null,null,null,null,null,null,null,null,null,null,null,null,null,null,null,null,null,null,null,null,null,null,null,null,0,0,null,null,null,null,null,null,null,null,null,null,null,null,null,null,null,null,null,null,null,null,null,null,null,null,null,null,null,null,null,null,null,null,null,null,null,null,null,null,null,null,null,null,null,null,null,null,null,null,null,null,null,null,null,null,null,null,null,null,null,null,null,null,null,null,null,null,null,null,null,null,null,null,null,null,null,null,null,null,null,null,null,null,null,null,null,null,null,null,null,null,null,null,null,null,null,null,null,null,null,null,null,null,null,null,null,null,null,null,null,null,null,null,null,null,null,null,null,null,null,null,null,null,null,null,null,null,null,null,null,null,0,0]
[20,null,null,null,null,null,null,null,null,null,null,null,null,null,null,null,null,null,null,null,null,null,null,null,null,null,{"$f":"IF(LEFT(V29,3)=\"神経痛\",1,IF(LEFT(V29,3)=\"リウマ\",2,IF(LEFT(V29,3)=\"頚腕症\",3,IF(LEFT(V29,3)=\"五十肩\",4,IF(LEFT(V29,3)=\"腰痛症\",5,IF(LEFT(V29,3)=\"頚椎捻\",6,\"\"))))))","v":""},null,null,null,null,null,null,null,null,null,null,null,null,null,null,null,null,null,null,null,null,null,null,null,null,null,null,null,null,null,null,null,null,null,null,null,null,null,null,null,null,null,null,null,null,null,null,null,null,null,null,null,null,null,null,null,null,0,"","","","","","","","","","","","","","","","","","","","","","","","","","","","","","","","","","",null,null,null,null,null,"","","","","","","","",null,null,null,null,null,"","","","","","","","","",null,null,0,{"$f":"IF(Z29<>\"新規\",\"\",IF(AI29=3,基本!$E$14,IF(OR(AI29=1,AI29=2),基本!$E$13,\"\")))","v":""},{"$f":"IF(CF29=0,\"\",IF(AI29=3,基本!$E$16*CF29,IF(OR(AI29=1,AI29=2),基本!$E$15*CF29)))","v":""},{"$f":"IF(AJ29=\"\",\"\",IF(AJ29>0,基本!$E$17*CF29))","v":""},{"$f":"IF(ER29=0,\"\",IF(AM29<=4,基本!$E$18*ER29,IF(AM29>4,基本!$E$19*ER29)))","v":""},{"$f":"IF(AC29=\"\",\"\",IF(AC29>=1,基本!$E$20))","v":""},0,"","","","","","","",null,null,null,null,null,null,null,null,null,null,null,null,null,null,null,null,null,null,null,null,null,null,null,null,null,null,null,null,null,null,null,null,null,null,null,null,null,null,null,null,null,null,null,null,null,null,null,null,null,null,null,null,null,"","","","","","","","","","","","","","","","","","","","","","","","","","","","","","","","","","","","","","",null,null,"","","","","","","","","","","","","","","","","","","","","","","","","","","","","",null,null,null,null,null,null,null,null,null,null,null,null,null,null,null,null,null,null,null,null,null,null,null,null,null,null,null,null,null,null,null,null,null,null,null,null,null,null,null,null,null,null,null,null,null,null,null,null,null,null,null,null,null,null,null,null,null,null,null,null,null,null,null,null,null,null,null,null,null,null,null,null,null,null,null,null,null,null,null,null,null,null,null,null,null,null,null,null,null,null,null,null,null,null,null,null,null,null,null,null,null,null,null,null,null,null,null,null,null,null,null,null,null,null,null,null,null,null,null,null,null,null,null,null,null,null,null,null,null,null,null,null,null,null,null,0,0,null,null,null,null,null,null,null,null,null,null,null,null,null,null,null,null,null,null,null,null,null,null,null,null,null,null,null,null,null,null,null,null,null,null,null,null,null,null,null,null,null,null,null,null,null,null,null,null,null,null,null,null,null,null,null,null,null,null,null,null,null,null,null,null,null,null,null,null,null,null,null,null,null,null,null,null,null,null,null,null,null,null,null,null,null,null,null,null,null,null,null,null,null,null,null,null,null,null,null,null,null,null,null,null,null,null,null,null,null,null,null,null,null,null,null,null,null,null,null,null,null,null,null,null,null,null,null,null,null,null,0,0]
[21,null,null,null,null,null,null,null,null,null,null,null,null,null,null,null,null,null,null,null,null,null,null,null,null,null,{"$f":"IF(LEFT(V30,3)=\"神経痛\",1,IF(LEFT(V30,3)=\"リウマ\",2,IF(LEFT(V30,3)=\"頚腕症\",3,IF(LEFT(V30,3)=\"五十肩\",4,IF(LEFT(V30,3)=\"腰痛症\",5,IF(LEFT(V30,3)=\"頚椎捻\",6,\"\"))))))","v":""},null,null,null,null,null,null,null,null,null,null,null,null,null,null,null,null,null,null,null,null,null,null,null,null,null,null,null,null,null,null,null,null,null,null,null,null,null,null,null,null,null,null,null,null,null,null,null,null,null,null,null,null,null,null,null,null,0,"","","","","","","","","","","","","","","","","","","","","","","","","","","","","","","","","","",null,null,null,null,null,"","","","","","","","",null,null,null,null,null,"","","","","","","","","",null,null,0,{"$f":"IF(Z30<>\"新規\",\"\",IF(AI30=3,基本!$E$14,IF(OR(AI30=1,AI30=2),基本!$E$13,\"\")))","v":""},{"$f":"IF(CF30=0,\"\",IF(AI30=3,基本!$E$16*CF30,IF(OR(AI30=1,AI30=2),基本!$E$15*CF30)))","v":""},{"$f":"IF(AJ30=\"\",\"\",IF(AJ30>0,基本!$E$17*CF30))","v":""},{"$f":"IF(ER30=0,\"\",IF(AM30<=4,基本!$E$18*ER30,IF(AM30>4,基本!$E$19*ER30)))","v":""},{"$f":"IF(AC30=\"\",\"\",IF(AC30>=1,基本!$E$20))","v":""},0,"","","","","","","",null,null,null,null,null,null,null,null,null,null,null,null,null,null,null,null,null,null,null,null,null,null,null,null,null,null,null,null,null,null,null,null,null,null,null,null,null,null,null,null,null,null,null,null,null,null,null,null,null,null,null,null,null,"","","","","","","","","","","","","","","","","","","","","","","","","","","","","","","","","","","","","","",null,null,"","","","","","","","","","","","","","","","","","","","","","","","","","","","","",null,null,null,null,null,null,null,null,null,null,null,null,null,null,null,null,null,null,null,null,null,null,null,null,null,null,null,null,null,null,null,null,null,null,null,null,null,null,null,null,null,null,null,null,null,null,null,null,null,null,null,null,null,null,null,null,null,null,null,null,null,null,null,null,null,null,null,null,null,null,null,null,null,null,null,null,null,null,null,null,null,null,null,null,null,null,null,null,null,null,null,null,null,null,null,null,null,null,null,null,null,null,null,null,null,null,null,null,null,null,null,null,null,null,null,null,null,null,null,null,null,null,null,null,null,null,null,null,null,null,null,null,null,null,null,0,0,null,null,null,null,null,null,null,null,null,null,null,null,null,null,null,null,null,null,null,null,null,null,null,null,null,null,null,null,null,null,null,null,null,null,null,null,null,null,null,null,null,null,null,null,null,null,null,null,null,null,null,null,null,null,null,null,null,null,null,null,null,null,null,null,null,null,null,null,null,null,null,null,null,null,null,null,null,null,null,null,null,null,null,null,null,null,null,null,null,null,null,null,null,null,null,null,null,null,null,null,null,null,null,null,null,null,null,null,null,null,null,null,null,null,null,null,null,null,null,null,null,null,null,null,null,null,null,null,null,null,0,0]
[22,null,null,null,null,null,null,null,null,null,null,null,null,null,null,null,null,null,null,null,null,null,null,null,null,null,{"$f":"IF(LEFT(V31,3)=\"神経痛\",1,IF(LEFT(V31,3)=\"リウマ\",2,IF(LEFT(V31,3)=\"頚腕症\",3,IF(LEFT(V31,3)=\"五十肩\",4,IF(LEFT(V31,3)=\"腰痛症\",5,IF(LEFT(V31,3)=\"頚椎捻\",6,\"\"))))))","v":""},null,null,null,null,null,null,null,null,null,null,null,null,null,null,null,null,null,null,null,null,null,null,null,null,null,null,null,null,null,null,null,null,null,null,null,null,null,null,null,null,null,null,null,null,null,null,null,null,null,null,null,null,null,null,null,null,{"$f":"COUNTA(BA31:CE31)","v":0},{"$f":"IF(K31=0,\"\",K31)","v":""},{"$f":"IF(G31=0,\"\",G31)","v":""},{"$f":"IF(LEN(CH31)=0,\"\",LEN(CH31))","v":""},{"$f":"IF(CI31=2,LEFT(CH31),\"\")","v":""},{"$f":"IF(CH31=\"\",\"\",RIGHT(CH31))","v":""},{"$f":"IF(H31=0,\"\",H31)","v":""},{"$f":"IF(LEN(CL31)=0,\"\",LEN(CL31))","v":""},{"$f":"IF(CM31=3,LEFT(CL31),\"\")","v":""},{"$f":"IF(CM31=3,MID(CL31,2,1),IF(CM31=2,LEFT(CL31),\"\"))","v":""},{"$f":"RIGHT(CL31)","v":""},{"$f":"IF(I31=0,\"\",I31)","v":""},{"$f":"IF(LEN(CQ31)=0,\"\",LEN(CQ31))","v":""},{"$f":"IF(CR31=7,LEFT(CQ31),\"\")","v":""},{"$f":"IF(CR31=6,MID(CQ31,2,1),IF(CR31=5,LEFT(CQ31),\"\"))","v":""},{"$f":"IF(CR31=6,MID(CQ31,3,1),IF(CR31=5,MID(CQ31,2,1),IF(CR31=4,LEFT(CQ31),\"\")))","v":""},{"$f":"IF(CR31=6,MID(CQ31,4,1),IF(CR31=5,MID(CQ31,3,1),IF(CR31=4,MID(CQ31,2,1),IF(CR31=3,LEFT(CQ31),\"\"))))","v":""},{"$f":"IF(CR31=6,MID(CQ31,5,1),IF(CR31=5,MID(CQ31,4,1),IF(CR31=4,MID(CQ31,3,1),IF(CR31=3,MID(CQ31,2,1),IF(CR31=2,LEFT(CQ31),\"\")))))","v":""},{"$f":"IF(RIGHT(CR31)=0,\"\",RIGHT(CQ31))","v":""},{"$f":"IF(T31=0,\"\",T31)","v":""},{"$f":"LEFT(CY31)","v":""},{"$f":"MID(CY31,2,2)","v":""},{"$f":"MID(CY31,5,2)","v":""},{"$f":"MID(CY31,8,2)","v":""},{"$f":"IF($CZ31=\"T\",1911,IF($CZ31=\"S\",1925,IF($CZ31=\"H\",1988,IF($CZ31=\"R\",2018,\"\"))))","v":""},{"$f":"IF(DD31=\"\",\"\",DD31+DA31)","v":""},{"$f":"IF(DD31=\"\",\"\",DATE(DE31,DB31,DC31))","v":""},{"$f":"IF(DD31=\"\",\"\",DATEDIF(DF31,TODAY(),\"Y\"))","v":""},{"$f":"LEFT(DG31)","v":""},{"$f":"MID(DG31,2,1)","v":""},{"$f":"MID(DG31,3,1)","v":""},{"$f":"MID(DG31,5,1)","v":""},{"$f":"MID(DG31,6,1)","v":""},{"$f":"MID(DG31,7,1)","v":""},{"$f":"MID(DG31,8,1)","v":""},null,null,null,null,null,{"$f":"IF(Y31=0,\"\",Y31)","v":""},{"$f":"LEFT(DT31)","v":""},{"$f":"MID(DT31,2,2)","v":""},{"$f":"MID(DT31,5,2)","v":""},{"$f":"MID(DT31,8,2)","v":""},{"$f":"IF(DW31=\"\",\"\",VALUE(DW31))","v":""},{"$f":"IF(DV31=\"\",\"\",IF(VALUE(DV31)=$CW$6,IF(VALUE(DW31)=$CW$5,DX31,1),1))","v":""},{"$f":"IF(DV31=\"\",\"\",$CZ$5)","v":""},null,null,null,null,null,{"$f":"IF(DZ31=1,0,LEFT(DZ31))","v":""},{"$f":"IF(DZ31=1,1,RIGHT(DZ31))","v":""},{"$f":"LEFT(EA31)","v":""},{"$f":"MID(EA31,2,1)","v":""},{"$f":"IF(W31=0,\"\",W31)","v":""},{"$f":"IF(EK31=\"不詳\",\"\",IF(EK31=\"不明\",\"\",MID(EK31,2,2)))","v":""},{"$f":"MID(EK31,5,2)","v":""},{"$f":"MID(EK31,8,2)","v":""},{"$f":"LEFT(EK31)","v":""},null,null,{"$f":"COUNTIF(BA31:CE31,\"◎\")","v":0},{"$f":"IF(Z31<>\"新規\",\"\",IF(AI31=3,基本!$E$14,IF(OR(AI31=1,AI31=2),基本!$E$13,\"\")))","v":""},{"$f":"IF(CF31=0,\"\",IF(AI31=3,基本!$E$16*CF31,IF(OR(AI31=1,AI31=2),基本!$E$15*CF31)))","v":""},{"$f":"IF(AJ31=\"\",\"\",IF(AJ31>0,基本!$E$17*CF31))","v":""},{"$f":"IF(ER31=0,\"\",IF(AM31<=4,基本!$E$18*ER31,IF(AM31>4,基本!$E$19*ER31)))","v":""},{"$f":"IF(AC31=\"\",\"\",IF(AC31>=1,基本!$E$20))","v":""},{"$f":"SUM(ES31:EW31)","v":0},{"$f":"IF($E31=\"\",\"\",IF($E31=\"協会けんぽ\",$EX31,\"\"))","v":""},{"$f":"IF($E31=\"\",\"\",IF($E31=\"健保組合\",$EX31,\"\"))","v":""},{"$f":"IF($E31=\"\",\"\",IF($E31=\"国保一般\",$EX31,\"\"))","v":""},{"$f":"IF($E31=\"\",\"\",IF($E31=\"後期高齢者\",$EX31,\"\"))","v":""},{"$f":"IF($E31=\"\",\"\",IF($E31=\"共済組合\",$EX31,\"\"))","v":""},{"$f":"IF($E31=\"\",\"\",IF($E31=\"退職者国保\",$EX31,\"\"))","v":""},{"$f":"IF($E31=\"\",\"\",IF($E31=\"国保組合\",$EX31,\"\"))","v":""},null,null,null,null,null,null,null,null,null,null,null,null,null,null,null,null,null,null,null,null,null,null,null,null,null,null,null,null,null,null,null,null,null,null,null,null,null,null,null,null,null,null,null,null,null,null,null,null,null,null,null,null,null,{"$f":"IF(AT31=0,\"\",AT31)","v":""},{"$f":"LEFT(HG31,1)","v":""},{"$f":"MID(HG31,2,2)","v":""},{"$f":"MID(HG31,5,2)","v":""},{"$f":"MID(HG31,8,2)","v":""},{"$f":"IF(LEFT(V31,3)=\"神経痛\",1,IF(LEFT(V31,3)=\"リウマ\",2,IF(LEFT(V31,3)=\"頚腕症\",3,IF(LEFT(V31,3)=\"五十肩\",4,IF(LEFT(V31,3)=\"腰痛症\",5,IF(LEFT(V31,3)=\"頚椎捻\",6,\"\"))))))","v":""},{"$f":"IF(OR(BA31=\"○\",BA31=\"◎\"),1,\"\")","v":""},{"$f":"IF(OR(BB31=\"○\",BB31=\"◎\"),2,\"\")","v":""},{"$f":"IF(OR(BC31=\"○\",BC31=\"◎\"),3,\"\")","v":""},{"$f":"IF(OR(BD31=\"○\",BD31=\"◎\"),4,\"\")","v":""},{"$f":"IF(OR(BE31=\"○\",BE31=\"◎\"),5,\"\")","v":""},{"$f":"IF(OR(BF31=\"○\",BF31=\"◎\"),6,\"\")","v":""},{"$f":"IF(OR(BG31=\"○\",BG31=\"◎\"),7,\"\")","v":""},{"$f":"IF(OR(BH31=\"○\",BH31=\"◎\"),8,\"\")","v":""},{"$f":"IF(OR(BI31=\"○\",BI31=\"◎\"),9,\"\")","v":""},{"$f":"IF(OR(BJ31=\"○\",BJ31=\"◎\"),10,\"\")","v":""},{"$f":"IF(OR(BK31=\"○\",BK31=\"◎\"),11,\"\")","v":""},{"$f":"IF(OR(BL31=\"○\",BL31=\"◎\"),12,\"\")","v":""},{"$f":"IF(OR(BM31=\"○\",BM31=\"◎\"),13,\"\")","v":""},{"$f":"IF(OR(BN31=\"○\",BN31=\"◎\"),14,\"\")","v":""},{"$f":"IF(OR(BO31=\"○\",BO31=\"◎\"),15,\"\")","v":""},{"$f":"IF(OR(BP31=\"○\",BP31=\"◎\"),16,\"\")","v":""},{"$f":"IF(OR(BQ31=\"○\",BQ31=\"◎\"),17,\"\")","v":""},{"$f":"IF(OR(BR31=\"○\",BR31=\"◎\"),18,\"\")","v":""},{"$f":"IF(OR(BS31=\"○\",BS31=\"◎\"),19,\"\")","v":""},{"$f":"IF(OR(BT31=\"○\",BT31=\"◎\"),20,\"\")","v":""},{"$f":"IF(OR(BU31=\"○\",BU31=\"◎\"),21,\"\")","v":""},{"$f":"IF(OR(BV31=\"○\",BV31=\"◎\"),22,\"\")","v":""},{"$f":"IF(OR(BW31=\"○\",BW31=\"◎\"),23,\"\")","v":""},{"$f":"IF(OR(BX31=\"○\",BX31=\"◎\"),24,\"\")","v":""},{"$f":"IF(OR(BY31=\"○\",BY31=\"◎\"),25,\"\")","v":""},{"$f":"IF(OR(BZ31=\"○\",BZ31=\"◎\"),26,\"\")","v":""},{"$f":"IF(OR(CA31=\"○\",CA31=\"◎\"),27,\"\")","v":""},{"$f":"IF(OR(CB31=\"○\",CB31=\"◎\"),28,\"\")","v":""},{"$f":"IF(OR(CC31=\"○\",CC31=\"◎\"),29,\"\")","v":""},{"$f":"IF(OR(CD31=\"○\",CD31=\"◎\"),30,\"\")","v":""},{"$f":"IF(OR(CE31=\"○\",CE31=\"◎\"),31,\"\")","v":""},{"$f":"IF(MAX(HM31:IQ31)=0,\"\",MAX(HM31:IQ31))","v":""},null,null,{"$f":"IF(G31=\"\",\"\",G31)","v":""},{"$f":"IF(LEN(IU31)=0,\"\",LEN(IU31))","v":""},{"$f":"IF(IV31=8,LEFT(IU31),\"\")","v":""},{"$f":"IF(IV31=8,MID(IU31,2,1),IF(IV31=7,LEFT(IU31),\"\"))","v":""},{"$f":"IF(IV31=8,MID(IU31,3,1),IF(IV31=7,MID(IU31,2,1),IF(IV31=6,LEFT(IU31),\"\")))","v":""},{"$f":"IF(IV31=8,MID(IU31,4,1),IF(IV31=7,MID(IU31,3,1),IF(IV31=6,MID(IU31,2,1),IF(IV31=5,LEFT(IU31),\"\"))))","v":""},{"$f":"IF(IV31=8,MID(IU31,5,1),IF(IV31=7,MID(IU31,4,1),IF(IV31=6,MID(IU31,3,1),IF(IV31=5,MID(IU31,2,1),IF(IV31=4,LEFT(IU31),\"\")))))","v":""},{"$f":"IF(IV31=8,MID(IU31,6,1),IF(IV31=7,MID(IU31,5,1),IF(IV31=6,MID(IU31,4,1),IF(IV31=5,MID(IU31,3,1),IF(IV31=4,MID(IU31,2,1),IF(IV31=3,LEFT(IU31),\"\"))))))","v":""},{"$f":"IF(IV31=8,MID(IU31,7,1),IF(IV31=7,MID(IU31,6,1),IF(IV31=6,MID(IU31,5,1),IF(IV31=5,MID(IU31,4,1),IF(IV31=4,MID(IU31,3,1),IF(IV31=3,MID(IU31,2,1),IF(IV31=2,LEFT(IU31),\"\")))))))","v":""},{"$f":"IF(RIGHT(IV31)=0,\"\",RIGHT(IU31))","v":""},{"$f":"IF(H31=\"\",\"\",H31)","v":""},{"$f":"IF(LEN(JE31)=0,\"\",LEN(JE31))","v":""},{"$f":"IF(JF31=7,LEFT(JE31),\"\")","v":""},{"$f":"IF(JF31=7,MID(JE31,2,1),IF(JF31=6,LEFT(JE31),\"\"))","v":""},{"$f":"IF(JF31=7,MID(JE31,3,1),IF(JF31=6,MID(JE31,2,1),IF(JF31=5,LEFT(JE31,1),\"\")))","v":""},{"$f":"IF(JF31=7,MID(JE31,4,1),IF(JF31=6,MID(JE31,3,1),IF(JF31=5,MID(JE31,2,1),IF(JF31=4,LEFT(JE31,1),\"\"))))","v":""},{"$f":"IF(JF31=7,MID(JE31,5,1),IF(JF31=6,MID(JE31,4,1),IF(JF31=5,MID(JE31,3,1),IF(JF31=4,MID(JE31,2,1),IF(JF31=3,LEFT(JE31,1),\"\")))))","v":""},{"$f":"IF(JF31=7,MID(JE31,6,1),IF(JF31=6,MID(JE31,5,1),IF(JF31=5,MID(JE31,4,1),IF(JF31=4,MID(JE31,3,1),IF(JF31=3,MID(JE31,2,1),\"\")))))","v":""},{"$f":"IF(RIGHT(JE31)=0,\"\",RIGHT(JE31))","v":""},{"$f":"IF(B31=\"\",\"\",B31)","v":""},{"$f":"IF(LEN(JN31)=0,\"\",LEN(JN31))","v":""},{"$f":"IF(JO31=8,LEFT(JN31),\"\")","v":""},{"$f":"IF(JO31=8,MID(JN31,2,1),IF(JO31=7,LEFT(JN31),\"\"))","v":""},{"$f":"IF(JO31=8,MID(JN31,3,1),IF(JO31=7,MID(JN31,2,1),IF(JO31=6,LEFT(JN31),\"\")))","v":""},{"$f":"IF(JO31=8,MID(JN31,4,1),IF(JO31=7,MID(JN31,3,1),IF(JO31=6,MID(JN31,2,1),IF(JO31=5,LEFT(JN31),\"\"))))","v":""},{"$f":"IF(JO31=8,MID(JN31,5,1),IF(JO31=7,MID(JN31,4,1),IF(JO31=6,MID(JN31,3,1),IF(JO31=5,MID(JN31,2,1),IF(JO31=4,LEFT(JN31),\"\")))))","v":""},{"$f":"IF(JO31=8,MID(JN31,6,1),IF(JO31=7,MID(JN31,5,1),IF(JO31=6,MID(JN31,4,1),IF(JO31=5,MID(JN31,3,1),IF(JO31=4,MID(JN31,2,1),IF(JO31=3,LEFT(JN31),\"\"))))))","v":""},{"$f":"IF(JO31=8,MID(JN31,7,1),IF(JO31=7,MID(JN31,6,1),IF(JO31=6,MID(JN31,5,1),IF(JO31=5,MID(JN31,4,1),IF(JO31=4,MID(JN31,3,1),IF(JO31=3,MID(JN31,2,1),IF(JO31=2,LEFT(JN31),\"\")))))))","v":""},{"$f":"IF(RIGHT(JO31)=0,\"\",RIGHT(JN31))","v":""},null,null,null,null,null,null,null,null,null,null,null,null,null,null,null,null,null,null,null,null,null,null,null,null,null,null,null,null,null,null,null,null,null,null,null,null,null,null,null,null,null,null,null,null,null,null,null,null,null,null,null,null,null,null,null,null,null,null,null,null,null,null,null,null,null,null,null,null,null,null,null,null,null,null,null,null,null,null,null,null,null,null,null,null,null,null,null,null,null,null,null,null,null,null,null,null,null,null,null,null,null,null,null,null,null,null,null,null,null,null,null,null,null,null,null,null,null,null,null,null,null,null,null,null,null,null,null,null,null,null,null,null,null,null,null,0,0,null,null,null,null,null,null,null,null,null,null,null,null,null,null,null,null,null,null,null,null,null,null,null,null,null,null,null,null,null,null,null,null,null,null,null,null,null,null,null,null,null,null,null,null,null,null,null,null,null,null,null,null,null,null,null,null,null,null,null,null,null,null,null,null,null,null,null,null,null,null,null,null,null,null,null,null,null,null,null,null,null,null,null,null,null,null,null,null,null,null,null,null,null,null,null,null,null,null,null,null,null,null,null,null,null,null,null,null,null,null,null,null,null,null,null,null,null,null,null,null,null,null,null,null,null,null,null,null,null,null,0,0]
[23,null,null,null,null,null,null,null,null,null,null,null,null,null,null,null,null,null,null,null,null,null,null,null,null,null,"",null,null,null,null,null,null,null,null,null,null,null,null,null,null,null,null,null,null,null,null,null,null,null,null,null,null,null,null,null,null,null,null,null,null,null,null,null,null,null,null,null,null,null,null,null,null,null,null,null,null,null,null,null,null,null,null,0,"","","","","","","","","","","","","","","","","","","","","","","","","","","","","","","","","","",null,null,null,null,null,"","","","","","","","",null,null,null,null,null,"","","","","","","","","",null,null,0,{"$f":"IF(Z32<>\"新規\",\"\",IF(AI32=3,基本!$E$14,IF(OR(AI32=1,AI32=2),基本!$E$13,\"\")))","v":""},{"$f":"IF(CF32=0,\"\",IF(AI32=3,基本!$E$16*CF32,IF(OR(AI32=1,AI32=2),基本!$E$15*CF32)))","v":""},{"$f":"IF(AJ32=\"\",\"\",IF(AJ32>0,基本!$E$17*CF32))","v":""},{"$f":"IF(ER32=0,\"\",IF(AM32<=4,基本!$E$18*ER32,IF(AM32>4,基本!$E$19*ER32)))","v":""},{"$f":"IF(AC32=\"\",\"\",IF(AC32>=1,基本!$E$20))","v":""},0,"","","","","","","",null,null,null,null,null,null,null,null,null,null,null,null,null,null,null,null,null,null,null,null,null,null,null,null,null,null,null,null,null,null,null,null,null,null,null,null,null,null,null,null,null,null,null,null,null,null,null,null,null,null,null,null,null,"","","","","","","","","","","","","","","","","","","","","","","","","","","","","","","","","","","","","","",null,null,"","","","","","","","","","","","","","","","","","","","","","","","","","","","","",null,null,null,null,null,null,null,null,null,null,null,null,null,null,null,null,null,null,null,null,null,null,null,null,null,null,null,null,null,null,null,null,null,null,null,null,null,null,null,null,null,null,null,null,null,null,null,null,null,null,null,null,null,null,null,null,null,null,null,null,null,null,null,null,null,null,null,null,null,null,null,null,null,null,null,null,null,null,null,null,null,null,null,null,null,null,null,null,null,null,null,null,null,null,null,null,null,null,null,null,null,null,null,null,null,null,null,null,null,null,null,null,null,null,null,null,null,null,null,null,null,null,null,null,null,null,null,null,null,null,null,null,null,null,null,0,0,null,null,null,null,null,null,null,null,null,null,null,null,null,null,null,null,null,null,null,null,null,null,null,null,null,null,null,null,null,null,null,null,null,null,null,null,null,null,null,null,null,null,null,null,null,null,null,null,null,null,null,null,null,null,null,null,null,null,null,null,null,null,null,null,null,null,null,null,null,null,null,null,null,null,null,null,null,null,null,null,null,null,null,null,null,null,null,null,null,null,null,null,null,null,null,null,null,null,null,null,null,null,null,null,null,null,null,null,null,null,null,null,null,null,null,null,null,null,null,null,null,null,null,null,null,null,null,null,null,null,0,0]
[24,null,null,null,null,null,null,null,null,null,null,null,null,null,null,null,null,null,null,null,null,null,null,null,null,null,"",null,null,null,null,null,null,null,null,null,null,null,null,null,null,null,null,null,null,null,null,null,null,null,null,null,null,null,null,null,null,null,null,null,null,null,null,null,null,null,null,null,null,null,null,null,null,null,null,null,null,null,null,null,null,null,null,0,"","","","","","","","","","","","","","","","","","","","","","","","","","","","","","","","","","",null,null,null,null,null,"","","","","","","","",null,null,null,null,null,"","","","","","","","","",null,null,0,{"$f":"IF(Z33<>\"新規\",\"\",IF(AI33=3,基本!$E$14,IF(OR(AI33=1,AI33=2),基本!$E$13,\"\")))","v":""},{"$f":"IF(CF33=0,\"\",IF(AI33=3,基本!$E$16*CF33,IF(OR(AI33=1,AI33=2),基本!$E$15*CF33)))","v":""},{"$f":"IF(AJ33=\"\",\"\",IF(AJ33>0,基本!$E$17*CF33))","v":""},{"$f":"IF(ER33=0,\"\",IF(AM33<=4,基本!$E$18*ER33,IF(AM33>4,基本!$E$19*ER33)))","v":""},{"$f":"IF(AC33=\"\",\"\",IF(AC33>=1,基本!$E$20))","v":""},0,"","","","","","","",null,null,null,null,null,null,null,null,null,null,null,null,null,null,null,null,null,null,null,null,null,null,null,null,null,null,null,null,null,null,null,null,null,null,null,null,null,null,null,null,null,null,null,null,null,null,null,null,null,null,null,null,null,"","","","","","","","","","","","","","","","","","","","","","","","","","","","","","","","","","","","","","",null,null,"","","","","","","","","","","","","","","","","","","","","","","","","","","","","",null,null,null,null,null,null,null,null,null,null,null,null,null,null,null,null,null,null,null,null,null,null,null,null,null,null,null,null,null,null,null,null,null,null,null,null,null,null,null,null,null,null,null,null,null,null,null,null,null,null,null,null,null,null,null,null,null,null,null,null,null,null,null,null,null,null,null,null,null,null,null,null,null,null,null,null,null,null,null,null,null,null,null,null,null,null,null,null,null,null,null,null,null,null,null,null,null,null,null,null,null,null,null,null,null,null,null,null,null,null,null,null,null,null,null,null,null,null,null,null,null,null,null,null,null,null,null,null,null,null,null,null,null,null,null,0,0,null,null,null,null,null,null,null,null,null,null,null,null,null,null,null,null,null,null,null,null,null,null,null,null,null,null,null,null,null,null,null,null,null,null,null,null,null,null,null,null,null,null,null,null,null,null,null,null,null,null,null,null,null,null,null,null,null,null,null,null,null,null,null,null,null,null,null,null,null,null,null,null,null,null,null,null,null,null,null,null,null,null,null,null,null,null,null,null,null,null,null,null,null,null,null,null,null,null,null,null,null,null,null,null,null,null,null,null,null,null,null,null,null,null,null,null,null,null,null,null,null,null,null,null,null,null,null,null,null,null,0,0]
[25,null,null,null,null,null,null,null,null,null,null,null,null,null,null,null,null,null,null,null,null,null,null,null,null,null,"",null,null,null,null,null,null,null,null,null,null,null,null,null,null,null,null,null,null,null,null,null,null,null,null,null,null,null,null,null,null,null,null,null,null,null,null,null,null,null,null,null,null,null,null,null,null,null,null,null,null,null,null,null,null,null,null,0,"","","","","","","","","","","","","","","","","","","","","","","","","","","","","","","","","","",null,null,null,null,null,"","","","","","","","",null,null,null,null,null,"","","","","","","","","",null,null,0,{"$f":"IF(Z34<>\"新規\",\"\",IF(AI34=3,基本!$E$14,IF(OR(AI34=1,AI34=2),基本!$E$13,\"\")))","v":""},{"$f":"IF(CF34=0,\"\",IF(AI34=3,基本!$E$16*CF34,IF(OR(AI34=1,AI34=2),基本!$E$15*CF34)))","v":""},{"$f":"IF(AJ34=\"\",\"\",IF(AJ34>0,基本!$E$17*CF34))","v":""},{"$f":"IF(ER34=0,\"\",IF(AM34<=4,基本!$E$18*ER34,IF(AM34>4,基本!$E$19*ER34)))","v":""},{"$f":"IF(AC34=\"\",\"\",IF(AC34>=1,基本!$E$20))","v":""},0,"","","","","","","",null,null,null,null,null,null,null,null,null,null,null,null,null,null,null,null,null,null,null,null,null,null,null,null,null,null,null,null,null,null,null,null,null,null,null,null,null,null,null,null,null,null,null,null,null,null,null,null,null,null,null,null,null,"","","","","","","","","","","","","","","","","","","","","","","","","","","","","","","","","","","","","","",null,null,"","","","","","","","","","","","","","","","","","","","","","","","","","","","","",null,null,null,null,null,null,null,null,null,null,null,null,null,null,null,null,null,null,null,null,null,null,null,null,null,null,null,null,null,null,null,null,null,null,null,null,null,null,null,null,null,null,null,null,null,null,null,null,null,null,null,null,null,null,null,null,null,null,null,null,null,null,null,null,null,null,null,null,null,null,null,null,null,null,null,null,null,null,null,null,null,null,null,null,null,null,null,null,null,null,null,null,null,null,null,null,null,null,null,null,null,null,null,null,null,null,null,null,null,null,null,null,null,null,null,null,null,null,null,null,null,null,null,null,null,null,null,null,null,null,null,null,null,null,null,0,0,null,null,null,null,null,null,null,null,null,null,null,null,null,null,null,null,null,null,null,null,null,null,null,null,null,null,null,null,null,null,null,null,null,null,null,null,null,null,null,null,null,null,null,null,null,null,null,null,null,null,null,null,null,null,null,null,null,null,null,null,null,null,null,null,null,null,null,null,null,null,null,null,null,null,null,null,null,null,null,null,null,null,null,null,null,null,null,null,null,null,null,null,null,null,null,null,null,null,null,null,null,null,null,null,null,null,null,null,null,null,null,null,null,null,null,null,null,null,null,null,null,null,null,null,null,null,null,null,null,null,0,0]
[26,null,null,null,null,null,null,null,null,null,null,null,null,null,null,null,null,null,null,null,null,null,null,null,null,null,"",null,null,null,null,null,null,null,null,null,null,null,null,null,null,null,null,null,null,null,null,null,null,null,null,null,null,null,null,null,null,null,null,null,null,null,null,null,null,null,null,null,null,null,null,null,null,null,null,null,null,null,null,null,null,null,null,0,"","","","","","","","","","","","","","","","","","","","","","","","","","","","","","","","","","",null,null,null,null,null,"","","","","","","","",null,null,null,null,null,"","","","","","","","","",null,null,0,{"$f":"IF(Z35<>\"新規\",\"\",IF(AI35=3,基本!$E$14,IF(OR(AI35=1,AI35=2),基本!$E$13,\"\")))","v":""},{"$f":"IF(CF35=0,\"\",IF(AI35=3,基本!$E$16*CF35,IF(OR(AI35=1,AI35=2),基本!$E$15*CF35)))","v":""},{"$f":"IF(AJ35=\"\",\"\",IF(AJ35>0,基本!$E$17*CF35))","v":""},{"$f":"IF(ER35=0,\"\",IF(AM35<=4,基本!$E$18*ER35,IF(AM35>4,基本!$E$19*ER35)))","v":""},{"$f":"IF(AC35=\"\",\"\",IF(AC35>=1,基本!$E$20))","v":""},0,"","","","","","","",null,null,null,null,null,null,null,null,null,null,null,null,null,null,null,null,null,null,null,null,null,null,null,null,null,null,null,null,null,null,null,null,null,null,null,null,null,null,null,null,null,null,null,null,null,null,null,null,null,null,null,null,null,"","","","","","","","","","","","","","","","","","","","","","","","","","","","","","","","","","","","","","",null,null,"","","","","","","","","","","","","","","","","","","","","","","","","","","","","",null,null,null,null,null,null,null,null,null,null,null,null,null,null,null,null,null,null,null,null,null,null,null,null,null,null,null,null,null,null,null,null,null,null,null,null,null,null,null,null,null,null,null,null,null,null,null,null,null,null,null,null,null,null,null,null,null,null,null,null,null,null,null,null,null,null,null,null,null,null,null,null,null,null,null,null,null,null,null,null,null,null,null,null,null,null,null,null,null,null,null,null,null,null,null,null,null,null,null,null,null,null,null,null,null,null,null,null,null,null,null,null,null,null,null,null,null,null,null,null,null,null,null,null,null,null,null,null,null,null,null,null,null,null,null,0,0,null,null,null,null,null,null,null,null,null,null,null,null,null,null,null,null,null,null,null,null,null,null,null,null,null,null,null,null,null,null,null,null,null,null,null,null,null,null,null,null,null,null,null,null,null,null,null,null,null,null,null,null,null,null,null,null,null,null,null,null,null,null,null,null,null,null,null,null,null,null,null,null,null,null,null,null,null,null,null,null,null,null,null,null,null,null,null,null,null,null,null,null,null,null,null,null,null,null,null,null,null,null,null,null,null,null,null,null,null,null,null,null,null,null,null,null,null,null,null,null,null,null,null,null,null,null,null,null,null,null,0,0]
[27,null,null,null,null,null,null,null,null,null,null,null,null,null,null,null,null,null,null,null,null,null,null,null,null,null,"",null,null,null,null,null,null,null,null,null,null,null,null,null,null,null,null,null,null,null,null,null,null,null,null,null,null,null,null,null,null,null,null,null,null,null,null,null,null,null,null,null,null,null,null,null,null,null,null,null,null,null,null,null,null,null,null,0,"","","","","","","","","","","","","","","","","","","","","","","","","","","","","","","","","","",null,null,null,null,null,"","","","","","","","",null,null,null,null,null,"","","","","","","","","",null,null,0,{"$f":"IF(Z36<>\"新規\",\"\",IF(AI36=3,基本!$E$14,IF(OR(AI36=1,AI36=2),基本!$E$13,\"\")))","v":""},{"$f":"IF(CF36=0,\"\",IF(AI36=3,基本!$E$16*CF36,IF(OR(AI36=1,AI36=2),基本!$E$15*CF36)))","v":""},{"$f":"IF(AJ36=\"\",\"\",IF(AJ36>0,基本!$E$17*CF36))","v":""},{"$f":"IF(ER36=0,\"\",IF(AM36<=4,基本!$E$18*ER36,IF(AM36>4,基本!$E$19*ER36)))","v":""},{"$f":"IF(AC36=\"\",\"\",IF(AC36>=1,基本!$E$20))","v":""},0,"","","","","","","",null,null,null,null,null,null,null,null,null,null,null,null,null,null,null,null,null,null,null,null,null,null,null,null,null,null,null,null,null,null,null,null,null,null,null,null,null,null,null,null,null,null,null,null,null,null,null,null,null,null,null,null,null,"","","","","","","","","","","","","","","","","","","","","","","","","","","","","","","","","","","","","","",null,null,"","","","","","","","","","","","","","","","","","","","","","","","","","","","","",null,null,null,null,null,null,null,null,null,null,null,null,null,null,null,null,null,null,null,null,null,null,null,null,null,null,null,null,null,null,null,null,null,null,null,null,null,null,null,null,null,null,null,null,null,null,null,null,null,null,null,null,null,null,null,null,null,null,null,null,null,null,null,null,null,null,null,null,null,null,null,null,null,null,null,null,null,null,null,null,null,null,null,null,null,null,null,null,null,null,null,null,null,null,null,null,null,null,null,null,null,null,null,null,null,null,null,null,null,null,null,null,null,null,null,null,null,null,null,null,null,null,null,null,null,null,null,null,null,null,null,null,null,null,null,0,0,null,null,null,null,null,null,null,null,null,null,null,null,null,null,null,null,null,null,null,null,null,null,null,null,null,null,null,null,null,null,null,null,null,null,null,null,null,null,null,null,null,null,null,null,null,null,null,null,null,null,null,null,null,null,null,null,null,null,null,null,null,null,null,null,null,null,null,null,null,null,null,null,null,null,null,null,null,null,null,null,null,null,null,null,null,null,null,null,null,null,null,null,null,null,null,null,null,null,null,null,null,null,null,null,null,null,null,null,null,null,null,null,null,null,null,null,null,null,null,null,null,null,null,null,null,null,null,null,null,null,0,0]
[28,null,null,null,null,null,null,null,null,null,null,null,null,null,null,null,null,null,null,null,null,null,null,null,null,null,"",null,null,null,null,null,null,null,null,null,null,null,null,null,null,null,null,null,null,null,null,null,null,null,null,null,null,null,null,null,null,null,null,null,null,null,null,null,null,null,null,null,null,null,null,null,null,null,null,null,null,null,null,null,null,null,null,0,"","","","","","","","","","","","","","","","","","","","","","","","","","","","","","","","","","",null,null,null,null,null,"","","","","","","","",null,null,null,null,null,"","","","","","","","","",null,null,0,{"$f":"IF(Z37<>\"新規\",\"\",IF(AI37=3,基本!$E$14,IF(OR(AI37=1,AI37=2),基本!$E$13,\"\")))","v":""},{"$f":"IF(CF37=0,\"\",IF(AI37=3,基本!$E$16*CF37,IF(OR(AI37=1,AI37=2),基本!$E$15*CF37)))","v":""},{"$f":"IF(AJ37=\"\",\"\",IF(AJ37>0,基本!$E$17*CF37))","v":""},{"$f":"IF(ER37=0,\"\",IF(AM37<=4,基本!$E$18*ER37,IF(AM37>4,基本!$E$19*ER37)))","v":""},{"$f":"IF(AC37=\"\",\"\",IF(AC37>=1,基本!$E$20))","v":""},0,"","","","","","","",null,null,null,null,null,null,null,null,null,null,null,null,null,null,null,null,null,null,null,null,null,null,null,null,null,null,null,null,null,null,null,null,null,null,null,null,null,null,null,null,null,null,null,null,null,null,null,null,null,null,null,null,null,"","","","","","","","","","","","","","","","","","","","","","","","","","","","","","","","","","","","","","",null,null,"","","","","","","","","","","","","","","","","","","","","","","","","","","","","",null,null,null,null,null,null,null,null,null,null,null,null,null,null,null,null,null,null,null,null,null,null,null,null,null,null,null,null,null,null,null,null,null,null,null,null,null,null,null,null,null,null,null,null,null,null,null,null,null,null,null,null,null,null,null,null,null,null,null,null,null,null,null,null,null,null,null,null,null,null,null,null,null,null,null,null,null,null,null,null,null,null,null,null,null,null,null,null,null,null,null,null,null,null,null,null,null,null,null,null,null,null,null,null,null,null,null,null,null,null,null,null,null,null,null,null,null,null,null,null,null,null,null,null,null,null,null,null,null,null,null,null,null,null,null,0,0,null,null,null,null,null,null,null,null,null,null,null,null,null,null,null,null,null,null,null,null,null,null,null,null,null,null,null,null,null,null,null,null,null,null,null,null,null,null,null,null,null,null,null,null,null,null,null,null,null,null,null,null,null,null,null,null,null,null,null,null,null,null,null,null,null,null,null,null,null,null,null,null,null,null,null,null,null,null,null,null,null,null,null,null,null,null,null,null,null,null,null,null,null,null,null,null,null,null,null,null,null,null,null,null,null,null,null,null,null,null,null,null,null,null,null,null,null,null,null,null,null,null,null,null,null,null,null,null,null,null,0,0]
[29,null,null,null,null,null,null,null,null,null,null,null,null,null,null,null,null,null,null,null,null,null,null,null,null,null,"",null,null,null,null,null,null,null,null,null,null,null,null,null,null,null,null,null,null,null,null,null,null,null,null,null,null,null,null,null,null,null,null,null,null,null,null,null,null,null,null,null,null,null,null,null,null,null,null,null,null,null,null,null,null,null,null,0,"","","","","","","","","","","","","","","","","","","","","","","","","","","","","","","","","","",null,null,null,null,null,"","","","","","","","",null,null,null,null,null,"","","","","","","","","",null,null,0,{"$f":"IF(Z38<>\"新規\",\"\",IF(AI38=3,基本!$E$14,IF(OR(AI38=1,AI38=2),基本!$E$13,\"\")))","v":""},{"$f":"IF(CF38=0,\"\",IF(AI38=3,基本!$E$16*CF38,IF(OR(AI38=1,AI38=2),基本!$E$15*CF38)))","v":""},{"$f":"IF(AJ38=\"\",\"\",IF(AJ38>0,基本!$E$17*CF38))","v":""},{"$f":"IF(ER38=0,\"\",IF(AM38<=4,基本!$E$18*ER38,IF(AM38>4,基本!$E$19*ER38)))","v":""},{"$f":"IF(AC38=\"\",\"\",IF(AC38>=1,基本!$E$20))","v":""},0,"","","","","","","",null,null,null,null,null,null,null,null,null,null,null,null,null,null,null,null,null,null,null,null,null,null,null,null,null,null,null,null,null,null,null,null,null,null,null,null,null,null,null,null,null,null,null,null,null,null,null,null,null,null,null,null,null,"","","","","","","","","","","","","","","","","","","","","","","","","","","","","","","","","","","","","","",null,null,"","","","","","","","","","","","","","","","","","","","","","","","","","","","","",null,null,null,null,null,null,null,null,null,null,null,null,null,null,null,null,null,null,null,null,null,null,null,null,null,null,null,null,null,null,null,null,null,null,null,null,null,null,null,null,null,null,null,null,null,null,null,null,null,null,null,null,null,null,null,null,null,null,null,null,null,null,null,null,null,null,null,null,null,null,null,null,null,null,null,null,null,null,null,null,null,null,null,null,null,null,null,null,null,null,null,null,null,null,null,null,null,null,null,null,null,null,null,null,null,null,null,null,null,null,null,null,null,null,null,null,null,null,null,null,null,null,null,null,null,null,null,null,null,null,null,null,null,null,null,0,0,null,null,null,null,null,null,null,null,null,null,null,null,null,null,null,null,null,null,null,null,null,null,null,null,null,null,null,null,null,null,null,null,null,null,null,null,null,null,null,null,null,null,null,null,null,null,null,null,null,null,null,null,null,null,null,null,null,null,null,null,null,null,null,null,null,null,null,null,null,null,null,null,null,null,null,null,null,null,null,null,null,null,null,null,null,null,null,null,null,null,null,null,null,null,null,null,null,null,null,null,null,null,null,null,null,null,null,null,null,null,null,null,null,null,null,null,null,null,null,null,null,null,null,null,null,null,null,null,null,null,0,0]
[30,null,null,null,null,null,null,null,null,null,null,null,null,null,null,null,null,null,null,null,null,null,null,null,null,null,"",null,null,null,null,null,null,null,null,null,null,null,null,null,null,null,null,null,null,null,null,null,null,null,null,null,null,null,null,null,null,null,null,null,null,null,null,null,null,null,null,null,null,null,null,null,null,null,null,null,null,null,null,null,null,null,null,0,"","","","","","","","","","","","","","","","","","","","","","","","","","","","","","","","","","",null,null,null,null,null,"","","","","","","","",null,null,null,null,null,"","","","","","","","","",null,null,0,{"$f":"IF(Z39<>\"新規\",\"\",IF(AI39=3,基本!$E$14,IF(OR(AI39=1,AI39=2),基本!$E$13,\"\")))","v":""},{"$f":"IF(CF39=0,\"\",IF(AI39=3,基本!$E$16*CF39,IF(OR(AI39=1,AI39=2),基本!$E$15*CF39)))","v":""},{"$f":"IF(AJ39=\"\",\"\",IF(AJ39>0,基本!$E$17*CF39))","v":""},{"$f":"IF(ER39=0,\"\",IF(AM39<=4,基本!$E$18*ER39,IF(AM39>4,基本!$E$19*ER39)))","v":""},{"$f":"IF(AC39=\"\",\"\",IF(AC39>=1,基本!$E$20))","v":""},0,"","","","","","","",null,null,null,null,null,null,null,null,null,null,null,null,null,null,null,null,null,null,null,null,null,null,null,null,null,null,null,null,null,null,null,null,null,null,null,null,null,null,null,null,null,null,null,null,null,null,null,null,null,null,null,null,null,"","","","","","","","","","","","","","","","","","","","","","","","","","","","","","","","","","","","","","",null,null,"","","","","","","","","","","","","","","","","","","","","","","","","","","","","",null,null,null,null,null,null,null,null,null,null,null,null,null,null,null,null,null,null,null,null,null,null,null,null,null,null,null,null,null,null,null,null,null,null,null,null,null,null,null,null,null,null,null,null,null,null,null,null,null,null,null,null,null,null,null,null,null,null,null,null,null,null,null,null,null,null,null,null,null,null,null,null,null,null,null,null,null,null,null,null,null,null,null,null,null,null,null,null,null,null,null,null,null,null,null,null,null,null,null,null,null,null,null,null,null,null,null,null,null,null,null,null,null,null,null,null,null,null,null,null,null,null,null,null,null,null,null,null,null,null,null,null,null,null,null,0,0,null,null,null,null,null,null,null,null,null,null,null,null,null,null,null,null,null,null,null,null,null,null,null,null,null,null,null,null,null,null,null,null,null,null,null,null,null,null,null,null,null,null,null,null,null,null,null,null,null,null,null,null,null,null,null,null,null,null,null,null,null,null,null,null,null,null,null,null,null,null,null,null,null,null,null,null,null,null,null,null,null,null,null,null,null,null,null,null,null,null,null,null,null,null,null,null,null,null,null,null,null,null,null,null,null,null,null,null,null,null,null,null,null,null,null,null,null,null,null,null,null,null,null,null,null,null,null,null,null,null,0,0]
[31,null,null,null,null,null,null,null,null,null,null,null,null,null,null,null,null,null,null,null,null,null,null,null,null,null,"",null,null,null,null,null,null,null,null,null,null,null,null,null,null,null,null,null,null,null,null,null,null,null,null,null,null,null,null,null,null,null,null,null,null,null,null,null,null,null,null,null,null,null,null,null,null,null,null,null,null,null,null,null,null,null,null,0,"","","","","","","","","","","","","","","","","","","","","","","","","","","","","","","","","","",null,null,null,null,null,"","","","","","","","",null,null,null,null,null,"","","","","","","","","",null,null,0,{"$f":"IF(Z40<>\"新規\",\"\",IF(AI40=3,基本!$E$14,IF(OR(AI40=1,AI40=2),基本!$E$13,\"\")))","v":""},{"$f":"IF(CF40=0,\"\",IF(AI40=3,基本!$E$16*CF40,IF(OR(AI40=1,AI40=2),基本!$E$15*CF40)))","v":""},{"$f":"IF(AJ40=\"\",\"\",IF(AJ40>0,基本!$E$17*CF40))","v":""},{"$f":"IF(ER40=0,\"\",IF(AM40<=4,基本!$E$18*ER40,IF(AM40>4,基本!$E$19*ER40)))","v":""},{"$f":"IF(AC40=\"\",\"\",IF(AC40>=1,基本!$E$20))","v":""},0,"","","","","","","",null,null,null,null,null,null,null,null,null,null,null,null,null,null,null,null,null,null,null,null,null,null,null,null,null,null,null,null,null,null,null,null,null,null,null,null,null,null,null,null,null,null,null,null,null,null,null,null,null,null,null,null,null,"","","","","","","","","","","","","","","","","","","","","","","","","","","","","","","","","","","","","","",null,null,"","","","","","","","","","","","","","","","","","","","","","","","","","","","","",null,null,null,null,null,null,null,null,null,null,null,null,null,null,null,null,null,null,null,null,null,null,null,null,null,null,null,null,null,null,null,null,null,null,null,null,null,null,null,null,null,null,null,null,null,null,null,null,null,null,null,null,null,null,null,null,null,null,null,null,null,null,null,null,null,null,null,null,null,null,null,null,null,null,null,null,null,null,null,null,null,null,null,null,null,null,null,null,null,null,null,null,null,null,null,null,null,null,null,null,null,null,null,null,null,null,null,null,null,null,null,null,null,null,null,null,null,null,null,null,null,null,null,null,null,null,null,null,null,null,null,null,null,null,null,0,0,null,null,null,null,null,null,null,null,null,null,null,null,null,null,null,null,null,null,null,null,null,null,null,null,null,null,null,null,null,null,null,null,null,null,null,null,null,null,null,null,null,null,null,null,null,null,null,null,null,null,null,null,null,null,null,null,null,null,null,null,null,null,null,null,null,null,null,null,null,null,null,null,null,null,null,null,null,null,null,null,null,null,null,null,null,null,null,null,null,null,null,null,null,null,null,null,null,null,null,null,null,null,null,null,null,null,null,null,null,null,null,null,null,null,null,null,null,null,null,null,null,null,null,null,null,null,null,null,null,null,0,0]
[32,null,null,null,null,null,null,null,null,null,null,null,null,null,null,null,null,null,null,null,null,null,null,null,null,null,"",null,null,null,null,null,null,null,null,null,null,null,null,null,null,null,null,null,null,null,null,null,null,null,null,null,null,null,null,null,null,null,null,null,null,null,null,null,null,null,null,null,null,null,null,null,null,null,null,null,null,null,null,null,null,null,null,0,"","","","","","","","","","","","","","","","","","","","","","","","","","","","","","","","","","",null,null,null,null,null,"","","","","","","","",null,null,null,null,null,"","","","","","","","","",null,null,0,{"$f":"IF(Z41<>\"新規\",\"\",IF(AI41=3,基本!$E$14,IF(OR(AI41=1,AI41=2),基本!$E$13,\"\")))","v":""},{"$f":"IF(CF41=0,\"\",IF(AI41=3,基本!$E$16*CF41,IF(OR(AI41=1,AI41=2),基本!$E$15*CF41)))","v":""},{"$f":"IF(AJ41=\"\",\"\",IF(AJ41>0,基本!$E$17*CF41))","v":""},{"$f":"IF(ER41=0,\"\",IF(AM41<=4,基本!$E$18*ER41,IF(AM41>4,基本!$E$19*ER41)))","v":""},{"$f":"IF(AC41=\"\",\"\",IF(AC41>=1,基本!$E$20))","v":""},0,"","","","","","","",null,null,null,null,null,null,null,null,null,null,null,null,null,null,null,null,null,null,null,null,null,null,null,null,null,null,null,null,null,null,null,null,null,null,null,null,null,null,null,null,null,null,null,null,null,null,null,null,null,null,null,null,null,"","","","","","","","","","","","","","","","","","","","","","","","","","","","","","","","","","","","","","",null,null,"","","","","","","","","","","","","","","","","","","","","","","","","","","","","",null,null,null,null,null,null,null,null,null,null,null,null,null,null,null,null,null,null,null,null,null,null,null,null,null,null,null,null,null,null,null,null,null,null,null,null,null,null,null,null,null,null,null,null,null,null,null,null,null,null,null,null,null,null,null,null,null,null,null,null,null,null,null,null,null,null,null,null,null,null,null,null,null,null,null,null,null,null,null,null,null,null,null,null,null,null,null,null,null,null,null,null,null,null,null,null,null,null,null,null,null,null,null,null,null,null,null,null,null,null,null,null,null,null,null,null,null,null,null,null,null,null,null,null,null,null,null,null,null,null,null,null,null,null,null,0,0,null,null,null,null,null,null,null,null,null,null,null,null,null,null,null,null,null,null,null,null,null,null,null,null,null,null,null,null,null,null,null,null,null,null,null,null,null,null,null,null,null,null,null,null,null,null,null,null,null,null,null,null,null,null,null,null,null,null,null,null,null,null,null,null,null,null,null,null,null,null,null,null,null,null,null,null,null,null,null,null,null,null,null,null,null,null,null,null,null,null,null,null,null,null,null,null,null,null,null,null,null,null,null,null,null,null,null,null,null,null,null,null,null,null,null,null,null,null,null,null,null,null,null,null,null,null,null,null,null,null,0,0]
[33,null,null,null,null,null,null,null,null,null,null,null,null,null,null,null,null,null,null,null,null,null,null,null,null,null,"",null,null,null,null,null,null,null,null,null,null,null,null,null,null,null,null,null,null,null,null,null,null,null,null,null,null,null,null,null,null,null,null,null,null,null,null,null,null,null,null,null,null,null,null,null,null,null,null,null,null,null,null,null,null,null,null,0,"","","","","","","","","","","","","","","","","","","","","","","","","","","","","","","","","","",null,null,null,null,null,"","","","","","","","",null,null,null,null,null,"","","","","","","","","",null,null,0,{"$f":"IF(Z42<>\"新規\",\"\",IF(AI42=3,基本!$E$14,IF(OR(AI42=1,AI42=2),基本!$E$13,\"\")))","v":""},{"$f":"IF(CF42=0,\"\",IF(AI42=3,基本!$E$16*CF42,IF(OR(AI42=1,AI42=2),基本!$E$15*CF42)))","v":""},{"$f":"IF(AJ42=\"\",\"\",IF(AJ42>0,基本!$E$17*CF42))","v":""},{"$f":"IF(ER42=0,\"\",IF(AM42<=4,基本!$E$18*ER42,IF(AM42>4,基本!$E$19*ER42)))","v":""},{"$f":"IF(AC42=\"\",\"\",IF(AC42>=1,基本!$E$20))","v":""},0,{"$f":"IF($E42=\"\",\"\",IF($E42=\"協会けんぽ\",$EX42,\"\"))","v":""},{"$f":"IF($E42=\"\",\"\",IF($E42=\"健保組合\",$EX42,\"\"))","v":""},{"$f":"IF($E42=\"\",\"\",IF($E42=\"国保一般\",$EX42,\"\"))","v":""},{"$f":"IF($E42=\"\",\"\",IF($E42=\"後期高齢者\",$EX42,\"\"))","v":""},{"$f":"IF($E42=\"\",\"\",IF($E42=\"共済組合\",$EX42,\"\"))","v":""},{"$f":"IF($E42=\"\",\"\",IF($E42=\"退職者国保\",$EX42,\"\"))","v":""},{"$f":"IF($E42=\"\",\"\",IF($E42=\"国保組合\",$EX42,\"\"))","v":""},null,null,null,null,null,null,null,null,null,null,null,null,null,null,null,null,null,null,null,null,null,null,null,null,null,null,null,null,null,null,null,null,null,null,null,null,null,null,null,null,null,null,null,null,null,null,null,null,null,null,null,null,null,{"$f":"IF(AT42=0,\"\",AT42)","v":""},"",{"$f":"MID(HG42,2,2)","v":""},{"$f":"MID(HG42,5,2)","v":""},{"$f":"MID(HG42,8,2)","v":""},"","","","","","","","","","","","","","","","","","","","","","","","","","","","","","","","","",null,null,"","","","","","","","","","","","","","","","","","","","","","","","","","","","","",null,null,null,null,null,null,null,null,null,null,null,null,null,null,null,null,null,null,null,null,null,null,null,null,null,null,null,null,null,null,null,null,null,null,null,null,null,null,null,null,null,null,null,null,null,null,null,null,null,null,null,null,null,null,null,null,null,null,null,null,null,null,null,null,null,null,null,null,null,null,null,null,null,null,null,null,null,null,null,null,null,null,null,null,null,null,null,null,null,null,null,null,null,null,null,null,null,null,null,null,null,null,null,null,null,null,null,null,null,null,null,null,null,null,null,null,null,null,null,null,null,null,null,null,null,null,null,null,null,null,null,null,null,null,null,0,0,null,null,null,null,null,null,null,null,null,null,null,null,null,null,null,null,null,null,null,null,null,null,null,null,null,null,null,null,null,null,null,null,null,null,null,null,null,null,null,null,null,null,null,null,null,null,null,null,null,null,null,null,null,null,null,null,null,null,null,null,null,null,null,null,null,null,null,null,null,null,null,null,null,null,null,null,null,null,null,null,null,null,null,null,null,null,null,null,null,null,null,null,null,null,null,null,null,null,null,null,null,null,null,null,null,null,null,null,null,null,null,null,null,null,null,null,null,null,null,null,null,null,null,null,null,null,null,null,null,null,0,0]
[34,null,null,null,null,null,null,null,null,null,null,null,null,null,null,null,null,null,null,null,null,null,null,null,null,null,"",null,null,null,null,null,null,null,null,null,null,null,null,null,null,null,null,null,null,null,null,null,null,null,null,null,null,null,null,null,null,null,null,null,null,null,null,null,null,null,null,null,null,null,null,null,null,null,null,null,null,null,null,null,null,null,null,0,"","","","","","","","","","","","","","","","","","","","","","","","","","","","","","","","","","",null,null,null,null,null,"","","","","","","","",null,null,null,null,null,"","","","","","","","","",null,null,0,{"$f":"IF(Z43<>\"新規\",\"\",IF(AI43=3,基本!$E$14,IF(OR(AI43=1,AI43=2),基本!$E$13,\"\")))","v":""},{"$f":"IF(CF43=0,\"\",IF(AI43=3,基本!$E$16*CF43,IF(OR(AI43=1,AI43=2),基本!$E$15*CF43)))","v":""},{"$f":"IF(AJ43=\"\",\"\",IF(AJ43>0,基本!$E$17*CF43))","v":""},{"$f":"IF(ER43=0,\"\",IF(AM43<=4,基本!$E$18*ER43,IF(AM43>4,基本!$E$19*ER43)))","v":""},{"$f":"IF(AC43=\"\",\"\",IF(AC43>=1,基本!$E$20))","v":""},0,"","","","","","","",null,null,null,null,null,null,null,null,null,null,null,null,null,null,null,null,null,null,null,null,null,null,null,null,null,null,null,null,null,null,null,null,null,null,null,null,null,null,null,null,null,null,null,null,null,null,null,null,null,null,null,null,null,"","","","","","","","","","","","","","","","","","","","","","","","","","","","","","","","","","","","","","",null,null,"","","","","","","","","","","","","","","","","","","","","","","","","","","","","",null,null,null,null,null,null,null,null,null,null,null,null,null,null,null,null,null,null,null,null,null,null,null,null,null,null,null,null,null,null,null,null,null,null,null,null,null,null,null,null,null,null,null,null,null,null,null,null,null,null,null,null,null,null,null,null,null,null,null,null,null,null,null,null,null,null,null,null,null,null,null,null,null,null,null,null,null,null,null,null,null,null,null,null,null,null,null,null,null,null,null,null,null,null,null,null,null,null,null,null,null,null,null,null,null,null,null,null,null,null,null,null,null,null,null,null,null,null,null,null,null,null,null,null,null,null,null,null,null,null,null,null,null,null,null,0,0,null,null,null,null,null,null,null,null,null,null,null,null,null,null,null,null,null,null,null,null,null,null,null,null,null,null,null,null,null,null,null,null,null,null,null,null,null,null,null,null,null,null,null,null,null,null,null,null,null,null,null,null,null,null,null,null,null,null,null,null,null,null,null,null,null,null,null,null,null,null,null,null,null,null,null,null,null,null,null,null,null,null,null,null,null,null,null,null,null,null,null,null,null,null,null,null,null,null,null,null,null,null,null,null,null,null,null,null,null,null,null,null,null,null,null,null,null,null,null,null,null,null,null,null,null,null,null,null,null,null,0,0]
[35,null,null,null,null,null,null,null,null,null,null,null,null,null,null,null,null,null,null,null,null,null,null,null,null,null,"",null,null,null,null,null,null,null,null,null,null,null,null,null,null,null,null,null,null,null,null,null,null,null,null,null,null,null,null,null,null,null,null,null,null,null,null,null,null,null,null,null,null,null,null,null,null,null,null,null,null,null,null,null,null,null,null,0,"","","","","","","","","","","","","","","","","","","","","","","","","","","","","","","","","","",null,null,null,null,null,"","","","","","","","",null,null,null,null,null,"","","","","","","","","",null,null,0,{"$f":"IF(Z44<>\"新規\",\"\",IF(AI44=3,基本!$E$14,IF(OR(AI44=1,AI44=2),基本!$E$13,\"\")))","v":""},{"$f":"IF(CF44=0,\"\",IF(AI44=3,基本!$E$16*CF44,IF(OR(AI44=1,AI44=2),基本!$E$15*CF44)))","v":""},{"$f":"IF(AJ44=\"\",\"\",IF(AJ44>0,基本!$E$17*CF44))","v":""},{"$f":"IF(ER44=0,\"\",IF(AM44<=4,基本!$E$18*ER44,IF(AM44>4,基本!$E$19*ER44)))","v":""},{"$f":"IF(AC44=\"\",\"\",IF(AC44>=1,基本!$E$20))","v":""},0,"","","","","","","",null,null,null,null,null,null,null,null,null,null,null,null,null,null,null,null,null,null,null,null,null,null,null,null,null,null,null,null,null,null,null,null,null,null,null,null,null,null,null,null,null,null,null,null,null,null,null,null,null,null,null,null,null,"","","","","","","","","","","","","","","","","","","","","","","","","","","","","","","","","","","","","","",null,null,"","","","","","","","","","","","","","","","","","","","","","","","","","","","","",null,null,null,null,null,null,null,null,null,null,null,null,null,null,null,null,null,null,null,null,null,null,null,null,null,null,null,null,null,null,null,null,null,null,null,null,null,null,null,null,null,null,null,null,null,null,null,null,null,null,null,null,null,null,null,null,null,null,null,null,null,null,null,null,null,null,null,null,null,null,null,null,null,null,null,null,null,null,null,null,null,null,null,null,null,null,null,null,null,null,null,null,null,null,null,null,null,null,null,null,null,null,null,null,null,null,null,null,null,null,null,null,null,null,null,null,null,null,null,null,null,null,null,null,null,null,null,null,null,null,null,null,null,null,null,0,0,null,null,null,null,null,null,null,null,null,null,null,null,null,null,null,null,null,null,null,null,null,null,null,null,null,null,null,null,null,null,null,null,null,null,null,null,null,null,null,null,null,null,null,null,null,null,null,null,null,null,null,null,null,null,null,null,null,null,null,null,null,null,null,null,null,null,null,null,null,null,null,null,null,null,null,null,null,null,null,null,null,null,null,null,null,null,null,null,null,null,null,null,null,null,null,null,null,null,null,null,null,null,null,null,null,null,null,null,null,null,null,null,null,null,null,null,null,null,null,null,null,null,null,null,null,null,null,null,null,null,0,0]
[36,null,null,null,null,null,null,null,null,null,null,null,null,null,null,null,null,null,null,null,null,null,null,null,null,null,"",null,null,null,null,null,null,null,null,null,null,null,null,null,null,null,null,null,null,null,null,null,null,null,null,null,null,null,null,null,null,null,null,null,null,null,null,null,null,null,null,null,null,null,null,null,null,null,null,null,null,null,null,null,null,null,null,0,"","","","","","","","","","","","","","","","","","","","","","","","","","","","","","","","","","",null,null,null,null,null,"","","","","","","","",null,null,null,null,null,"","","","","","","","","",null,null,0,{"$f":"IF(Z45<>\"新規\",\"\",IF(AI45=3,基本!$E$14,IF(OR(AI45=1,AI45=2),基本!$E$13,\"\")))","v":""},{"$f":"IF(CF45=0,\"\",IF(AI45=3,基本!$E$16*CF45,IF(OR(AI45=1,AI45=2),基本!$E$15*CF45)))","v":""},{"$f":"IF(AJ45=\"\",\"\",IF(AJ45>0,基本!$E$17*CF45))","v":""},{"$f":"IF(ER45=0,\"\",IF(AM45<=4,基本!$E$18*ER45,IF(AM45>4,基本!$E$19*ER45)))","v":""},{"$f":"IF(AC45=\"\",\"\",IF(AC45>=1,基本!$E$20))","v":""},0,"","","","","","","",null,null,null,null,null,null,null,null,null,null,null,null,null,null,null,null,null,null,null,null,null,null,null,null,null,null,null,null,null,null,null,null,null,null,null,null,null,null,null,null,null,null,null,null,null,null,null,null,null,null,null,null,null,"","","","","","","","","","","","","","","","","","","","","","","","","","","","","","","","","","","","","","",null,null,"","","","","","","","","","","","","","","","","","","","","","","","","","","","","",null,null,null,null,null,null,null,null,null,null,null,null,null,null,null,null,null,null,null,null,null,null,null,null,null,null,null,null,null,null,null,null,null,null,null,null,null,null,null,null,null,null,null,null,null,null,null,null,null,null,null,null,null,null,null,null,null,null,null,null,null,null,null,null,null,null,null,null,null,null,null,null,null,null,null,null,null,null,null,null,null,null,null,null,null,null,null,null,null,null,null,null,null,null,null,null,null,null,null,null,null,null,null,null,null,null,null,null,null,null,null,null,null,null,null,null,null,null,null,null,null,null,null,null,null,null,null,null,null,null,null,null,null,null,null,0,0,null,null,null,null,null,null,null,null,null,null,null,null,null,null,null,null,null,null,null,null,null,null,null,null,null,null,null,null,null,null,null,null,null,null,null,null,null,null,null,null,null,null,null,null,null,null,null,null,null,null,null,null,null,null,null,null,null,null,null,null,null,null,null,null,null,null,null,null,null,null,null,null,null,null,null,null,null,null,null,null,null,null,null,null,null,null,null,null,null,null,null,null,null,null,null,null,null,null,null,null,null,null,null,null,null,null,null,null,null,null,null,null,null,null,null,null,null,null,null,null,null,null,null,null,null,null,null,null,null,null,0,0]
[37,null,null,null,null,null,null,null,null,null,null,null,null,null,null,null,null,null,null,null,null,null,null,null,null,null,"",null,null,null,null,null,null,null,null,null,null,null,null,null,null,null,null,null,null,null,null,null,null,null,null,null,null,null,null,null,null,null,null,null,null,null,null,null,null,null,null,null,null,null,null,null,null,null,null,null,null,null,null,null,null,null,null,0,"","","","","","","","","","","","","","","","","","","","","","","","","","","","","","","","","","",null,null,null,null,null,"","","","","","","","",null,null,null,null,null,"","","","","","","","","",null,null,0,{"$f":"IF(Z46<>\"新規\",\"\",IF(AI46=3,基本!$E$14,IF(OR(AI46=1,AI46=2),基本!$E$13,\"\")))","v":""},{"$f":"IF(CF46=0,\"\",IF(AI46=3,基本!$E$16*CF46,IF(OR(AI46=1,AI46=2),基本!$E$15*CF46)))","v":""},{"$f":"IF(AJ46=\"\",\"\",IF(AJ46>0,基本!$E$17*CF46))","v":""},{"$f":"IF(ER46=0,\"\",IF(AM46<=4,基本!$E$18*ER46,IF(AM46>4,基本!$E$19*ER46)))","v":""},{"$f":"IF(AC46=\"\",\"\",IF(AC46>=1,基本!$E$20))","v":""},0,"","","","","","","",null,null,null,null,null,null,null,null,null,null,null,null,null,null,null,null,null,null,null,null,null,null,null,null,null,null,null,null,null,null,null,null,null,null,null,null,null,null,null,null,null,null,null,null,null,null,null,null,null,null,null,null,null,"","","","","","","","","","","","","","","","","","","","","","","","","","","","","","","","","","","","","","",null,null,"","","","","","","","","","","","","","","","","","","","","","","","","","","","","",null,null,null,null,null,null,null,null,null,null,null,null,null,null,null,null,null,null,null,null,null,null,null,null,null,null,null,null,null,null,null,null,null,null,null,null,null,null,null,null,null,null,null,null,null,null,null,null,null,null,null,null,null,null,null,null,null,null,null,null,null,null,null,null,null,null,null,null,null,null,null,null,null,null,null,null,null,null,null,null,null,null,null,null,null,null,null,null,null,null,null,null,null,null,null,null,null,null,null,null,null,null,null,null,null,null,null,null,null,null,null,null,null,null,null,null,null,null,null,null,null,null,null,null,null,null,null,null,null,null,null,null,null,null,null,0,0,null,null,null,null,null,null,null,null,null,null,null,null,null,null,null,null,null,null,null,null,null,null,null,null,null,null,null,null,null,null,null,null,null,null,null,null,null,null,null,null,null,null,null,null,null,null,null,null,null,null,null,null,null,null,null,null,null,null,null,null,null,null,null,null,null,null,null,null,null,null,null,null,null,null,null,null,null,null,null,null,null,null,null,null,null,null,null,null,null,null,null,null,null,null,null,null,null,null,null,null,null,null,null,null,null,null,null,null,null,null,null,null,null,null,null,null,null,null,null,null,null,null,null,null,null,null,null,null,null,null,0,0]
[38,null,null,null,null,null,null,null,null,null,null,null,null,null,null,null,null,null,null,null,null,null,null,null,null,null,"",null,null,null,null,null,null,null,null,null,null,null,null,null,null,null,null,null,null,null,null,null,null,null,null,null,null,null,null,null,null,null,null,null,null,null,null,null,null,null,null,null,null,null,null,null,null,null,null,null,null,null,null,null,null,null,null,0,"","","","","","","","","","","","","","","","","","","","","","","","","","","","","","","","","","",null,null,null,null,null,"","","","","","","","",null,null,null,null,null,"","","","","","","","","",null,null,0,{"$f":"IF(Z47<>\"新規\",\"\",IF(AI47=3,基本!$E$14,IF(OR(AI47=1,AI47=2),基本!$E$13,\"\")))","v":""},{"$f":"IF(CF47=0,\"\",IF(AI47=3,基本!$E$16*CF47,IF(OR(AI47=1,AI47=2),基本!$E$15*CF47)))","v":""},{"$f":"IF(AJ47=\"\",\"\",IF(AJ47>0,基本!$E$17*CF47))","v":""},{"$f":"IF(ER47=0,\"\",IF(AM47<=4,基本!$E$18*ER47,IF(AM47>4,基本!$E$19*ER47)))","v":""},{"$f":"IF(AC47=\"\",\"\",IF(AC47>=1,基本!$E$20))","v":""},0,"","","","","","","",null,null,null,null,null,null,null,null,null,null,null,null,null,null,null,null,null,null,null,null,null,null,null,null,null,null,null,null,null,null,null,null,null,null,null,null,null,null,null,null,null,null,null,null,null,null,null,null,null,null,null,null,null,"","","","","","","","","","","","","","","","","","","","","","","","","","","","","","","","","","","","","","",null,null,"","","","","","","","","","","","","","","","","","","","","","","","","","","","","",null,null,null,null,null,null,null,null,null,null,null,null,null,null,null,null,null,null,null,null,null,null,null,null,null,null,null,null,null,null,null,null,null,null,null,null,null,null,null,null,null,null,null,null,null,null,null,null,null,null,null,null,null,null,null,null,null,null,null,null,null,null,null,null,null,null,null,null,null,null,null,null,null,null,null,null,null,null,null,null,null,null,null,null,null,null,null,null,null,null,null,null,null,null,null,null,null,null,null,null,null,null,null,null,null,null,null,null,null,null,null,null,null,null,null,null,null,null,null,null,null,null,null,null,null,null,null,null,null,null,null,null,null,null,null,0,0,null,null,null,null,null,null,null,null,null,null,null,null,null,null,null,null,null,null,null,null,null,null,null,null,null,null,null,null,null,null,null,null,null,null,null,null,null,null,null,null,null,null,null,null,null,null,null,null,null,null,null,null,null,null,null,null,null,null,null,null,null,null,null,null,null,null,null,null,null,null,null,null,null,null,null,null,null,null,null,null,null,null,null,null,null,null,null,null,null,null,null,null,null,null,null,null,null,null,null,null,null,null,null,null,null,null,null,null,null,null,null,null,null,null,null,null,null,null,null,null,null,null,null,null,null,null,null,null,null,null,0,0]
[39,null,null,null,null,null,null,null,null,null,null,null,null,null,null,null,null,null,null,null,null,null,null,null,null,null,"",null,null,null,null,null,null,null,null,null,null,null,null,null,null,null,null,null,null,null,null,null,null,null,null,null,null,null,null,null,null,null,null,null,null,null,null,null,null,null,null,null,null,null,null,null,null,null,null,null,null,null,null,null,null,null,null,0,"","","","","","","","","","","","","","","","","","","","","","","","","","","","","","","","","","",null,null,null,null,null,"","","","","","","","",null,null,null,null,null,"","","","","","","","","",null,null,0,{"$f":"IF(Z48<>\"新規\",\"\",IF(AI48=3,基本!$E$14,IF(OR(AI48=1,AI48=2),基本!$E$13,\"\")))","v":""},{"$f":"IF(CF48=0,\"\",IF(AI48=3,基本!$E$16*CF48,IF(OR(AI48=1,AI48=2),基本!$E$15*CF48)))","v":""},{"$f":"IF(AJ48=\"\",\"\",IF(AJ48>0,基本!$E$17*CF48))","v":""},{"$f":"IF(ER48=0,\"\",IF(AM48<=4,基本!$E$18*ER48,IF(AM48>4,基本!$E$19*ER48)))","v":""},{"$f":"IF(AC48=\"\",\"\",IF(AC48>=1,基本!$E$20))","v":""},0,"","","","","","","",null,null,null,null,null,null,null,null,null,null,null,null,null,null,null,null,null,null,null,null,null,null,null,null,null,null,null,null,null,null,null,null,null,null,null,null,null,null,null,null,null,null,null,null,null,null,null,null,null,null,null,null,null,"","","","","","","","","","","","","","","","","","","","","","","","","","","","","","","","","","","","","","",null,null,"","","","","","","","","","","","","","","","","","","","","","","","","","","","","",null,null,null,null,null,null,null,null,null,null,null,null,null,null,null,null,null,null,null,null,null,null,null,null,null,null,null,null,null,null,null,null,null,null,null,null,null,null,null,null,null,null,null,null,null,null,null,null,null,null,null,null,null,null,null,null,null,null,null,null,null,null,null,null,null,null,null,null,null,null,null,null,null,null,null,null,null,null,null,null,null,null,null,null,null,null,null,null,null,null,null,null,null,null,null,null,null,null,null,null,null,null,null,null,null,null,null,null,null,null,null,null,null,null,null,null,null,null,null,null,null,null,null,null,null,null,null,null,null,null,null,null,null,null,null,0,0,null,null,null,null,null,null,null,null,null,null,null,null,null,null,null,null,null,null,null,null,null,null,null,null,null,null,null,null,null,null,null,null,null,null,null,null,null,null,null,null,null,null,null,null,null,null,null,null,null,null,null,null,null,null,null,null,null,null,null,null,null,null,null,null,null,null,null,null,null,null,null,null,null,null,null,null,null,null,null,null,null,null,null,null,null,null,null,null,null,null,null,null,null,null,null,null,null,null,null,null,null,null,null,null,null,null,null,null,null,null,null,null,null,null,null,null,null,null,null,null,null,null,null,null,null,null,null,null,null,null,0,0]
[40,null,null,null,null,null,null,null,null,null,null,null,null,null,null,null,null,null,null,null,null,null,null,null,null,null,"",null,null,null,null,null,null,null,null,null,null,null,null,null,null,null,null,null,null,null,null,null,null,null,null,null,null,null,null,null,null,null,null,null,null,null,null,null,null,null,null,null,null,null,null,null,null,null,null,null,null,null,null,null,null,null,null,0,"","","","","","","","","","","","","","","","","","","","","","","","","","","","","","","","","","",null,null,null,null,null,"","","","","","","","",null,null,null,null,null,"","","","","","","","","",null,null,0,{"$f":"IF(Z49<>\"新規\",\"\",IF(AI49=3,基本!$E$14,IF(OR(AI49=1,AI49=2),基本!$E$13,\"\")))","v":""},{"$f":"IF(CF49=0,\"\",IF(AI49=3,基本!$E$16*CF49,IF(OR(AI49=1,AI49=2),基本!$E$15*CF49)))","v":""},{"$f":"IF(AJ49=\"\",\"\",IF(AJ49>0,基本!$E$17*CF49))","v":""},{"$f":"IF(ER49=0,\"\",IF(AM49<=4,基本!$E$18*ER49,IF(AM49>4,基本!$E$19*ER49)))","v":""},{"$f":"IF(AC49=\"\",\"\",IF(AC49>=1,基本!$E$20))","v":""},0,"","","","","","","",null,null,null,null,null,null,null,null,null,null,null,null,null,null,null,null,null,null,null,null,null,null,null,null,null,null,null,null,null,null,null,null,null,null,null,null,null,null,null,null,null,null,null,null,null,null,null,null,null,null,null,null,null,"","","","","","","","","","","","","","","","","","","","","","","","","","","","","","","","","","","","","","",null,null,"","","","","","","","","","","","","","","","","","","","","","","","","","","","","",null,null,null,null,null,null,null,null,null,null,null,null,null,null,null,null,null,null,null,null,null,null,null,null,null,null,null,null,null,null,null,null,null,null,null,null,null,null,null,null,null,null,null,null,null,null,null,null,null,null,null,null,null,null,null,null,null,null,null,null,null,null,null,null,null,null,null,null,null,null,null,null,null,null,null,null,null,null,null,null,null,null,null,null,null,null,null,null,null,null,null,null,null,null,null,null,null,null,null,null,null,null,null,null,null,null,null,null,null,null,null,null,null,null,null,null,null,null,null,null,null,null,null,null,null,null,null,null,null,null,null,null,null,null,null,0,0,null,null,null,null,null,null,null,null,null,null,null,null,null,null,null,null,null,null,null,null,null,null,null,null,null,null,null,null,null,null,null,null,null,null,null,null,null,null,null,null,null,null,null,null,null,null,null,null,null,null,null,null,null,null,null,null,null,null,null,null,null,null,null,null,null,null,null,null,null,null,null,null,null,null,null,null,null,null,null,null,null,null,null,null,null,null,null,null,null,null,null,null,null,null,null,null,null,null,null,null,null,null,null,null,null,null,null,null,null,null,null,null,null,null,null,null,null,null,null,null,null,null,null,null,null,null,null,null,null,null,0,0]
[41,null,null,null,null,null,null,null,null,null,null,null,null,null,null,null,null,null,null,null,null,null,null,null,null,null,"",null,null,null,null,null,null,null,null,null,null,null,null,null,null,null,null,null,null,null,null,null,null,null,null,null,null,null,null,null,null,null,null,null,null,null,null,null,null,null,null,null,null,null,null,null,null,null,null,null,null,null,null,null,null,null,null,0,"","","","","","","","","","","","","","","","","","","","","","","","","","","","","","","","","","",null,null,null,null,null,"","","","","","","","",null,null,null,null,null,"","","","","","","","","",null,null,0,{"$f":"IF(Z50<>\"新規\",\"\",IF(AI50=3,基本!$E$14,IF(OR(AI50=1,AI50=2),基本!$E$13,\"\")))","v":""},{"$f":"IF(CF50=0,\"\",IF(AI50=3,基本!$E$16*CF50,IF(OR(AI50=1,AI50=2),基本!$E$15*CF50)))","v":""},{"$f":"IF(AJ50=\"\",\"\",IF(AJ50>0,基本!$E$17*CF50))","v":""},{"$f":"IF(ER50=0,\"\",IF(AM50<=4,基本!$E$18*ER50,IF(AM50>4,基本!$E$19*ER50)))","v":""},{"$f":"IF(AC50=\"\",\"\",IF(AC50>=1,基本!$E$20))","v":""},0,"","","","","","","",null,null,null,null,null,null,null,null,null,null,null,null,null,null,null,null,null,null,null,null,null,null,null,null,null,null,null,null,null,null,null,null,null,null,null,null,null,null,null,null,null,null,null,null,null,null,null,null,null,null,null,null,null,"","","","","","","","","","","","","","","","","","","","","","","","","","","","","","","","","","","","","","",null,null,"","","","","","","","","","","","","","","","","","","","","","","","","","","","","",null,null,null,null,null,null,null,null,null,null,null,null,null,null,null,null,null,null,null,null,null,null,null,null,null,null,null,null,null,null,null,null,null,null,null,null,null,null,null,null,null,null,null,null,null,null,null,null,null,null,null,null,null,null,null,null,null,null,null,null,null,null,null,null,null,null,null,null,null,null,null,null,null,null,null,null,null,null,null,null,null,null,null,null,null,null,null,null,null,null,null,null,null,null,null,null,null,null,null,null,null,null,null,null,null,null,null,null,null,null,null,null,null,null,null,null,null,null,null,null,null,null,null,null,null,null,null,null,null,null,null,null,null,null,null,0,0,null,null,null,null,null,null,null,null,null,null,null,null,null,null,null,null,null,null,null,null,null,null,null,null,null,null,null,null,null,null,null,null,null,null,null,null,null,null,null,null,null,null,null,null,null,null,null,null,null,null,null,null,null,null,null,null,null,null,null,null,null,null,null,null,null,null,null,null,null,null,null,null,null,null,null,null,null,null,null,null,null,null,null,null,null,null,null,null,null,null,null,null,null,null,null,null,null,null,null,null,null,null,null,null,null,null,null,null,null,null,null,null,null,null,null,null,null,null,null,null,null,null,null,null,null,null,null,null,null,null,0,0]
[42,null,null,null,null,null,null,null,null,null,null,null,null,null,null,null,null,null,null,null,null,null,null,null,null,null,"",null,null,null,null,null,null,null,null,null,null,null,null,null,null,null,null,null,null,null,null,null,null,null,null,null,null,null,null,null,null,null,null,null,null,null,null,null,null,null,null,null,null,null,null,null,null,null,null,null,null,null,null,null,null,null,null,0,"","","","","","","","","","","","","","","","","","","","","","","","","","","","","","","","","","",null,null,null,null,null,"","","","","","","","",null,null,null,null,null,"","","","","","","","","",null,null,0,{"$f":"IF(Z51<>\"新規\",\"\",IF(AI51=3,基本!$E$14,IF(OR(AI51=1,AI51=2),基本!$E$13,\"\")))","v":""},{"$f":"IF(CF51=0,\"\",IF(AI51=3,基本!$E$16*CF51,IF(OR(AI51=1,AI51=2),基本!$E$15*CF51)))","v":""},{"$f":"IF(AJ51=\"\",\"\",IF(AJ51>0,基本!$E$17*CF51))","v":""},{"$f":"IF(ER51=0,\"\",IF(AM51<=4,基本!$E$18*ER51,IF(AM51>4,基本!$E$19*ER51)))","v":""},{"$f":"IF(AC51=\"\",\"\",IF(AC51>=1,基本!$E$20))","v":""},0,"","","","","","","",null,null,null,null,null,null,null,null,null,null,null,null,null,null,null,null,null,null,null,null,null,null,null,null,null,null,null,null,null,null,null,null,null,null,null,null,null,null,null,null,null,null,null,null,null,null,null,null,null,null,null,null,null,"","","","","","","","","","","","","","","","","","","","","","","","","","","","","","","","","","","","","","",null,null,"","","","","","","","","","","","","","","","","","","","","","","","","","","","","",null,null,null,null,null,null,null,null,null,null,null,null,null,null,null,null,null,null,null,null,null,null,null,null,null,null,null,null,null,null,null,null,null,null,null,null,null,null,null,null,null,null,null,null,null,null,null,null,null,null,null,null,null,null,null,null,null,null,null,null,null,null,null,null,null,null,null,null,null,null,null,null,null,null,null,null,null,null,null,null,null,null,null,null,null,null,null,null,null,null,null,null,null,null,null,null,null,null,null,null,null,null,null,null,null,null,null,null,null,null,null,null,null,null,null,null,null,null,null,null,null,null,null,null,null,null,null,null,null,null,null,null,null,null,null,0,0,null,null,null,null,null,null,null,null,null,null,null,null,null,null,null,null,null,null,null,null,null,null,null,null,null,null,null,null,null,null,null,null,null,null,null,null,null,null,null,null,null,null,null,null,null,null,null,null,null,null,null,null,null,null,null,null,null,null,null,null,null,null,null,null,null,null,null,null,null,null,null,null,null,null,null,null,null,null,null,null,null,null,null,null,null,null,null,null,null,null,null,null,null,null,null,null,null,null,null,null,null,null,null,null,null,null,null,null,null,null,null,null,null,null,null,null,null,null,null,null,null,null,null,null,null,null,null,null,null,null,0,0]
[43,null,null,null,null,null,null,null,null,null,null,null,null,null,null,null,null,null,null,null,null,null,null,null,null,null,"",null,null,null,null,null,null,null,null,null,null,null,null,null,null,null,null,null,null,null,null,null,null,null,null,null,null,null,null,null,null,null,null,null,null,null,null,null,null,null,null,null,null,null,null,null,null,null,null,null,null,null,null,null,null,null,null,0,"","","","","","","","","","","","","","","","","","","","","","","","","","","","","","","","","","",null,null,null,null,null,"","","","","","","","",null,null,null,null,null,"","","","","","","","","",null,null,0,{"$f":"IF(Z52<>\"新規\",\"\",IF(AI52=3,基本!$E$14,IF(OR(AI52=1,AI52=2),基本!$E$13,\"\")))","v":""},{"$f":"IF(CF52=0,\"\",IF(AI52=3,基本!$E$16*CF52,IF(OR(AI52=1,AI52=2),基本!$E$15*CF52)))","v":""},{"$f":"IF(AJ52=\"\",\"\",IF(AJ52>0,基本!$E$17*CF52))","v":""},{"$f":"IF(ER52=0,\"\",IF(AM52<=4,基本!$E$18*ER52,IF(AM52>4,基本!$E$19*ER52)))","v":""},{"$f":"IF(AC52=\"\",\"\",IF(AC52>=1,基本!$E$20))","v":""},0,"","","","","","","",null,null,null,null,null,null,null,null,null,null,null,null,null,null,null,null,null,null,null,null,null,null,null,null,null,null,null,null,null,null,null,null,null,null,null,null,null,null,null,null,null,null,null,null,null,null,null,null,null,null,null,null,null,"","","","","","","","","","","","","","","","","","","","","","","","","","","","","","","","","","","","","","",null,null,"","","","","","","","","","","","","","","","","","","","","","","","","","","","","",null,null,null,null,null,null,null,null,null,null,null,null,null,null,null,null,null,null,null,null,null,null,null,null,null,null,null,null,null,null,null,null,null,null,null,null,null,null,null,null,null,null,null,null,null,null,null,null,null,null,null,null,null,null,null,null,null,null,null,null,null,null,null,null,null,null,null,null,null,null,null,null,null,null,null,null,null,null,null,null,null,null,null,null,null,null,null,null,null,null,null,null,null,null,null,null,null,null,null,null,null,null,null,null,null,null,null,null,null,null,null,null,null,null,null,null,null,null,null,null,null,null,null,null,null,null,null,null,null,null,null,null,null,null,null,0,0,null,null,null,null,null,null,null,null,null,null,null,null,null,null,null,null,null,null,null,null,null,null,null,null,null,null,null,null,null,null,null,null,null,null,null,null,null,null,null,null,null,null,null,null,null,null,null,null,null,null,null,null,null,null,null,null,null,null,null,null,null,null,null,null,null,null,null,null,null,null,null,null,null,null,null,null,null,null,null,null,null,null,null,null,null,null,null,null,null,null,null,null,null,null,null,null,null,null,null,null,null,null,null,null,null,null,null,null,null,null,null,null,null,null,null,null,null,null,null,null,null,null,null,null,null,null,null,null,null,null,0,0]
[44,null,null,null,null,null,null,null,null,null,null,null,null,null,null,null,null,null,null,null,null,null,null,null,null,null,"",null,null,null,null,null,null,null,null,null,null,null,null,null,null,null,null,null,null,null,null,null,null,null,null,null,null,null,null,null,null,null,null,null,null,null,null,null,null,null,null,null,null,null,null,null,null,null,null,null,null,null,null,null,null,null,null,0,"","","","","","","","","","","","","","","","","","","","","","","","","","","","","","","","","","",null,null,null,null,null,"","","","","","","","",null,null,null,null,null,"","","","","","","","","",null,null,0,{"$f":"IF(Z53<>\"新規\",\"\",IF(AI53=3,基本!$E$14,IF(OR(AI53=1,AI53=2),基本!$E$13,\"\")))","v":""},{"$f":"IF(CF53=0,\"\",IF(AI53=3,基本!$E$16*CF53,IF(OR(AI53=1,AI53=2),基本!$E$15*CF53)))","v":""},{"$f":"IF(AJ53=\"\",\"\",IF(AJ53>0,基本!$E$17*CF53))","v":""},{"$f":"IF(ER53=0,\"\",IF(AM53<=4,基本!$E$18*ER53,IF(AM53>4,基本!$E$19*ER53)))","v":""},{"$f":"IF(AC53=\"\",\"\",IF(AC53>=1,基本!$E$20))","v":""},0,"","","","","","","",null,null,null,null,null,null,null,null,null,null,null,null,null,null,null,null,null,null,null,null,null,null,null,null,null,null,null,null,null,null,null,null,null,null,null,null,null,null,null,null,null,null,null,null,null,null,null,null,null,null,null,null,null,"","","","","","","","","","","","","","","","","","","","","","","","","","","","","","","","","","","","","","",null,null,"","","","","","","","","","","","","","","","","","","","","","","","","","","","","",null,null,null,null,null,null,null,null,null,null,null,null,null,null,null,null,null,null,null,null,null,null,null,null,null,null,null,null,null,null,null,null,null,null,null,null,null,null,null,null,null,null,null,null,null,null,null,null,null,null,null,null,null,null,null,null,null,null,null,null,null,null,null,null,null,null,null,null,null,null,null,null,null,null,null,null,null,null,null,null,null,null,null,null,null,null,null,null,null,null,null,null,null,null,null,null,null,null,null,null,null,null,null,null,null,null,null,null,null,null,null,null,null,null,null,null,null,null,null,null,null,null,null,null,null,null,null,null,null,null,null,null,null,null,null,0,0,null,null,null,null,null,null,null,null,null,null,null,null,null,null,null,null,null,null,null,null,null,null,null,null,null,null,null,null,null,null,null,null,null,null,null,null,null,null,null,null,null,null,null,null,null,null,null,null,null,null,null,null,null,null,null,null,null,null,null,null,null,null,null,null,null,null,null,null,null,null,null,null,null,null,null,null,null,null,null,null,null,null,null,null,null,null,null,null,null,null,null,null,null,null,null,null,null,null,null,null,null,null,null,null,null,null,null,null,null,null,null,null,null,null,null,null,null,null,null,null,null,null,null,null,null,null,null,null,null,null,0,0]
[45,null,null,null,null,null,null,null,null,null,null,null,null,null,null,null,null,null,null,null,null,null,null,null,null,null,"",null,null,null,null,null,null,null,null,null,null,null,null,null,null,null,null,null,null,null,null,null,null,null,null,null,null,null,null,null,null,null,null,null,null,null,null,null,null,null,null,null,null,null,null,null,null,null,null,null,null,null,null,null,null,null,null,0,"","","","","","","","","","","","","","","","","","","","","","","","","","","","","","","","","","",null,null,null,null,null,"","","","","","","","",null,null,null,null,null,"","","","","","","","","",null,null,0,{"$f":"IF(Z54<>\"新規\",\"\",IF(AI54=3,基本!$E$14,IF(OR(AI54=1,AI54=2),基本!$E$13,\"\")))","v":""},{"$f":"IF(CF54=0,\"\",IF(AI54=3,基本!$E$16*CF54,IF(OR(AI54=1,AI54=2),基本!$E$15*CF54)))","v":""},{"$f":"IF(AJ54=\"\",\"\",IF(AJ54>0,基本!$E$17*CF54))","v":""},{"$f":"IF(ER54=0,\"\",IF(AM54<=4,基本!$E$18*ER54,IF(AM54>4,基本!$E$19*ER54)))","v":""},{"$f":"IF(AC54=\"\",\"\",IF(AC54>=1,基本!$E$20))","v":""},0,"","","","","","","",null,null,null,null,null,null,null,null,null,null,null,null,null,null,null,null,null,null,null,null,null,null,null,null,null,null,null,null,null,null,null,null,null,null,null,null,null,null,null,null,null,null,null,null,null,null,null,null,null,null,null,null,null,"","","","","","","","","","","","","","","","","","","","","","","","","","","","","","","","","","","","","","",null,null,"","","","","","","","","","","","","","","","","","","","","","","","","","","","","",null,null,null,null,null,null,null,null,null,null,null,null,null,null,null,null,null,null,null,null,null,null,null,null,null,null,null,null,null,null,null,null,null,null,null,null,null,null,null,null,null,null,null,null,null,null,null,null,null,null,null,null,null,null,null,null,null,null,null,null,null,null,null,null,null,null,null,null,null,null,null,null,null,null,null,null,null,null,null,null,null,null,null,null,null,null,null,null,null,null,null,null,null,null,null,null,null,null,null,null,null,null,null,null,null,null,null,null,null,null,null,null,null,null,null,null,null,null,null,null,null,null,null,null,null,null,null,null,null,null,null,null,null,null,null,0,0,null,null,null,null,null,null,null,null,null,null,null,null,null,null,null,null,null,null,null,null,null,null,null,null,null,null,null,null,null,null,null,null,null,null,null,null,null,null,null,null,null,null,null,null,null,null,null,null,null,null,null,null,null,null,null,null,null,null,null,null,null,null,null,null,null,null,null,null,null,null,null,null,null,null,null,null,null,null,null,null,null,null,null,null,null,null,null,null,null,null,null,null,null,null,null,null,null,null,null,null,null,null,null,null,null,null,null,null,null,null,null,null,null,null,null,null,null,null,null,null,null,null,null,null,null,null,null,null,null,null,0,0]
[46,null,null,null,null,null,null,null,null,null,null,null,null,null,null,null,null,null,null,null,null,null,null,null,null,null,"",null,null,null,null,null,null,null,null,null,null,null,null,null,null,null,null,null,null,null,null,null,null,null,null,null,null,null,null,null,null,null,null,null,null,null,null,null,null,null,null,null,null,null,null,null,null,null,null,null,null,null,null,null,null,null,null,0,"","","","","","","","","","","","","","","","","","","","","","","","","","","","","","","","","","",null,null,null,null,null,"","","","","","","","",null,null,null,null,null,"","","","","","","","","",null,null,0,{"$f":"IF(Z55<>\"新規\",\"\",IF(AI55=3,基本!$E$14,IF(OR(AI55=1,AI55=2),基本!$E$13,\"\")))","v":""},{"$f":"IF(CF55=0,\"\",IF(AI55=3,基本!$E$16*CF55,IF(OR(AI55=1,AI55=2),基本!$E$15*CF55)))","v":""},{"$f":"IF(AJ55=\"\",\"\",IF(AJ55>0,基本!$E$17*CF55))","v":""},{"$f":"IF(ER55=0,\"\",IF(AM55<=4,基本!$E$18*ER55,IF(AM55>4,基本!$E$19*ER55)))","v":""},{"$f":"IF(AC55=\"\",\"\",IF(AC55>=1,基本!$E$20))","v":""},0,"","","","","","","",null,null,null,null,null,null,null,null,null,null,null,null,null,null,null,null,null,null,null,null,null,null,null,null,null,null,null,null,null,null,null,null,null,null,null,null,null,null,null,null,null,null,null,null,null,null,null,null,null,null,null,null,null,"","","","","","","","","","","","","","","","","","","","","","","","","","","","","","","","","","","","","","",null,null,"","","","","","","","","","","","","","","","","","","","","","","","","","","","","",null,null,null,null,null,null,null,null,null,null,null,null,null,null,null,null,null,null,null,null,null,null,null,null,null,null,null,null,null,null,null,null,null,null,null,null,null,null,null,null,null,null,null,null,null,null,null,null,null,null,null,null,null,null,null,null,null,null,null,null,null,null,null,null,null,null,null,null,null,null,null,null,null,null,null,null,null,null,null,null,null,null,null,null,null,null,null,null,null,null,null,null,null,null,null,null,null,null,null,null,null,null,null,null,null,null,null,null,null,null,null,null,null,null,null,null,null,null,null,null,null,null,null,null,null,null,null,null,null,null,null,null,null,null,null,0,0,null,null,null,null,null,null,null,null,null,null,null,null,null,null,null,null,null,null,null,null,null,null,null,null,null,null,null,null,null,null,null,null,null,null,null,null,null,null,null,null,null,null,null,null,null,null,null,null,null,null,null,null,null,null,null,null,null,null,null,null,null,null,null,null,null,null,null,null,null,null,null,null,null,null,null,null,null,null,null,null,null,null,null,null,null,null,null,null,null,null,null,null,null,null,null,null,null,null,null,null,null,null,null,null,null,null,null,null,null,null,null,null,null,null,null,null,null,null,null,null,null,null,null,null,null,null,null,null,null,null,0,0]
[47,null,null,null,null,null,null,null,null,null,null,null,null,null,null,null,null,null,null,null,null,null,null,null,null,null,"",null,null,null,null,null,null,null,null,null,null,null,null,null,null,null,null,null,null,null,null,null,null,null,null,null,null,null,null,null,null,null,null,null,null,null,null,null,null,null,null,null,null,null,null,null,null,null,null,null,null,null,null,null,null,null,null,0,"","","","","","","","","","","","","","","","","","","","","","","","","","","","","","","","","","",null,null,null,null,null,"","","","","","","","",null,null,null,null,null,"","","","","","","","","",null,null,0,{"$f":"IF(Z56<>\"新規\",\"\",IF(AI56=3,基本!$E$14,IF(OR(AI56=1,AI56=2),基本!$E$13,\"\")))","v":""},{"$f":"IF(CF56=0,\"\",IF(AI56=3,基本!$E$16*CF56,IF(OR(AI56=1,AI56=2),基本!$E$15*CF56)))","v":""},{"$f":"IF(AJ56=\"\",\"\",IF(AJ56>0,基本!$E$17*CF56))","v":""},{"$f":"IF(ER56=0,\"\",IF(AM56<=4,基本!$E$18*ER56,IF(AM56>4,基本!$E$19*ER56)))","v":""},{"$f":"IF(AC56=\"\",\"\",IF(AC56>=1,基本!$E$20))","v":""},0,"","","","","","","",null,null,null,null,null,null,null,null,null,null,null,null,null,null,null,null,null,null,null,null,null,null,null,null,null,null,null,null,null,null,null,null,null,null,null,null,null,null,null,null,null,null,null,null,null,null,null,null,null,null,null,null,null,"","","","","","","","","","","","","","","","","","","","","","","","","","","","","","","","","","","","","","",null,null,"","","","","","","","","","","","","","","","","","","","","","","","","","","","","",null,null,null,null,null,null,null,null,null,null,null,null,null,null,null,null,null,null,null,null,null,null,null,null,null,null,null,null,null,null,null,null,null,null,null,null,null,null,null,null,null,null,null,null,null,null,null,null,null,null,null,null,null,null,null,null,null,null,null,null,null,null,null,null,null,null,null,null,null,null,null,null,null,null,null,null,null,null,null,null,null,null,null,null,null,null,null,null,null,null,null,null,null,null,null,null,null,null,null,null,null,null,null,null,null,null,null,null,null,null,null,null,null,null,null,null,null,null,null,null,null,null,null,null,null,null,null,null,null,null,null,null,null,null,null,0,0,null,null,null,null,null,null,null,null,null,null,null,null,null,null,null,null,null,null,null,null,null,null,null,null,null,null,null,null,null,null,null,null,null,null,null,null,null,null,null,null,null,null,null,null,null,null,null,null,null,null,null,null,null,null,null,null,null,null,null,null,null,null,null,null,null,null,null,null,null,null,null,null,null,null,null,null,null,null,null,null,null,null,null,null,null,null,null,null,null,null,null,null,null,null,null,null,null,null,null,null,null,null,null,null,null,null,null,null,null,null,null,null,null,null,null,null,null,null,null,null,null,null,null,null,null,null,null,null,null,null,0,0]
[48,null,null,null,null,null,null,null,null,null,null,null,null,null,null,null,null,null,null,null,null,null,null,null,null,null,"",null,null,null,null,null,null,null,null,null,null,null,null,null,null,null,null,null,null,null,null,null,null,null,null,null,null,null,null,null,null,null,null,null,null,null,null,null,null,null,null,null,null,null,null,null,null,null,null,null,null,null,null,null,null,null,null,0,"","","","","","","","","","","","","","","","","","","","","","","","","","","","","","","","","","",null,null,null,null,null,"","","","","","","","",null,null,null,null,null,"","","","","","","","","",null,null,0,{"$f":"IF(Z57<>\"新規\",\"\",IF(AI57=3,基本!$E$14,IF(OR(AI57=1,AI57=2),基本!$E$13,\"\")))","v":""},{"$f":"IF(CF57=0,\"\",IF(AI57=3,基本!$E$16*CF57,IF(OR(AI57=1,AI57=2),基本!$E$15*CF57)))","v":""},{"$f":"IF(AJ57=\"\",\"\",IF(AJ57>0,基本!$E$17*CF57))","v":""},{"$f":"IF(ER57=0,\"\",IF(AM57<=4,基本!$E$18*ER57,IF(AM57>4,基本!$E$19*ER57)))","v":""},{"$f":"IF(AC57=\"\",\"\",IF(AC57>=1,基本!$E$20))","v":""},0,"","","","","","","",null,null,null,null,null,null,null,null,null,null,null,null,null,null,null,null,null,null,null,null,null,null,null,null,null,null,null,null,null,null,null,null,null,null,null,null,null,null,null,null,null,null,null,null,null,null,null,null,null,null,null,null,null,"","","","","","","","","","","","","","","","","","","","","","","","","","","","","","","","","","","","","","",null,null,"","","","","","","","","","","","","","","","","","","","","","","","","","","","","",null,null,null,null,null,null,null,null,null,null,null,null,null,null,null,null,null,null,null,null,null,null,null,null,null,null,null,null,null,null,null,null,null,null,null,null,null,null,null,null,null,null,null,null,null,null,null,null,null,null,null,null,null,null,null,null,null,null,null,null,null,null,null,null,null,null,null,null,null,null,null,null,null,null,null,null,null,null,null,null,null,null,null,null,null,null,null,null,null,null,null,null,null,null,null,null,null,null,null,null,null,null,null,null,null,null,null,null,null,null,null,null,null,null,null,null,null,null,null,null,null,null,null,null,null,null,null,null,null,null,null,null,null,null,null,0,0,null,null,null,null,null,null,null,null,null,null,null,null,null,null,null,null,null,null,null,null,null,null,null,null,null,null,null,null,null,null,null,null,null,null,null,null,null,null,null,null,null,null,null,null,null,null,null,null,null,null,null,null,null,null,null,null,null,null,null,null,null,null,null,null,null,null,null,null,null,null,null,null,null,null,null,null,null,null,null,null,null,null,null,null,null,null,null,null,null,null,null,null,null,null,null,null,null,null,null,null,null,null,null,null,null,null,null,null,null,null,null,null,null,null,null,null,null,null,null,null,null,null,null,null,null,null,null,null,null,null,0,0]
[49,null,null,null,null,null,null,null,null,null,null,null,null,null,null,null,null,null,null,null,null,null,null,null,null,null,"",null,null,null,null,null,null,null,null,null,null,null,null,null,null,null,null,null,null,null,null,null,null,null,null,null,null,null,null,null,null,null,null,null,null,null,null,null,null,null,null,null,null,null,null,null,null,null,null,null,null,null,null,null,null,null,null,0,"","","","","","","","","","","","","","","","","","","","","","","","","","","","","","","","","","",null,null,null,null,null,"","","","","","","","",null,null,null,null,null,"","","","","","","","","",null,null,0,{"$f":"IF(Z58<>\"新規\",\"\",IF(AI58=3,基本!$E$14,IF(OR(AI58=1,AI58=2),基本!$E$13,\"\")))","v":""},{"$f":"IF(CF58=0,\"\",IF(AI58=3,基本!$E$16*CF58,IF(OR(AI58=1,AI58=2),基本!$E$15*CF58)))","v":""},{"$f":"IF(AJ58=\"\",\"\",IF(AJ58>0,基本!$E$17*CF58))","v":""},{"$f":"IF(ER58=0,\"\",IF(AM58<=4,基本!$E$18*ER58,IF(AM58>4,基本!$E$19*ER58)))","v":""},{"$f":"IF(AC58=\"\",\"\",IF(AC58>=1,基本!$E$20))","v":""},0,"","","","","","","",null,null,null,null,null,null,null,null,null,null,null,null,null,null,null,null,null,null,null,null,null,null,null,null,null,null,null,null,null,null,null,null,null,null,null,null,null,null,null,null,null,null,null,null,null,null,null,null,null,null,null,null,null,"","","","","","","","","","","","","","","","","","","","","","","","","","","","","","","","","","","","","","",null,null,"","","","","","","","","","","","","","","","","","","","","","","","","","","","","",null,null,null,null,null,null,null,null,null,null,null,null,null,null,null,null,null,null,null,null,null,null,null,null,null,null,null,null,null,null,null,null,null,null,null,null,null,null,null,null,null,null,null,null,null,null,null,null,null,null,null,null,null,null,null,null,null,null,null,null,null,null,null,null,null,null,null,null,null,null,null,null,null,null,null,null,null,null,null,null,null,null,null,null,null,null,null,null,null,null,null,null,null,null,null,null,null,null,null,null,null,null,null,null,null,null,null,null,null,null,null,null,null,null,null,null,null,null,null,null,null,null,null,null,null,null,null,null,null,null,null,null,null,null,null,0,0,null,null,null,null,null,null,null,null,null,null,null,null,null,null,null,null,null,null,null,null,null,null,null,null,null,null,null,null,null,null,null,null,null,null,null,null,null,null,null,null,null,null,null,null,null,null,null,null,null,null,null,null,null,null,null,null,null,null,null,null,null,null,null,null,null,null,null,null,null,null,null,null,null,null,null,null,null,null,null,null,null,null,null,null,null,null,null,null,null,null,null,null,null,null,null,null,null,null,null,null,null,null,null,null,null,null,null,null,null,null,null,null,null,null,null,null,null,null,null,null,null,null,null,null,null,null,null,null,null,null,0,0]
[50,null,null,null,null,null,null,null,null,null,null,null,null,null,null,null,null,null,null,null,null,null,null,null,null,null,"",null,null,null,null,null,null,null,null,null,null,null,null,null,null,null,null,null,null,null,null,null,null,null,null,null,null,null,null,null,null,null,null,null,null,null,null,null,null,null,null,null,null,null,null,null,null,null,null,null,null,null,null,null,null,null,null,0,"","","","","","","","","","","","","","","","","","","","","","","","","","","","","","","","","","",null,null,null,null,null,"","","","","","","","",null,null,null,null,null,"","","","","","","","","",null,null,0,{"$f":"IF(Z59<>\"新規\",\"\",IF(AI59=3,基本!$E$14,IF(OR(AI59=1,AI59=2),基本!$E$13,\"\")))","v":""},{"$f":"IF(CF59=0,\"\",IF(AI59=3,基本!$E$16*CF59,IF(OR(AI59=1,AI59=2),基本!$E$15*CF59)))","v":""},{"$f":"IF(AJ59=\"\",\"\",IF(AJ59>0,基本!$E$17*CF59))","v":""},{"$f":"IF(ER59=0,\"\",IF(AM59<=4,基本!$E$18*ER59,IF(AM59>4,基本!$E$19*ER59)))","v":""},{"$f":"IF(AC59=\"\",\"\",IF(AC59>=1,基本!$E$20))","v":""},0,"","","","","","","",null,null,null,null,null,null,null,null,null,null,null,null,null,null,null,null,null,null,null,null,null,null,null,null,null,null,null,null,null,null,null,null,null,null,null,null,null,null,null,null,null,null,null,null,null,null,null,null,null,null,null,null,null,"","","","","","","","","","","","","","","","","","","","","","","","","","","","","","","","","","","","","","",null,null,"","","","","","","","","","","","","","","","","","","","","","","","","","","","","",null,null,null,null,null,null,null,null,null,null,null,null,null,null,null,null,null,null,null,null,null,null,null,null,null,null,null,null,null,null,null,null,null,null,null,null,null,null,null,null,null,null,null,null,null,null,null,null,null,null,null,null,null,null,null,null,null,null,null,null,null,null,null,null,null,null,null,null,null,null,null,null,null,null,null,null,null,null,null,null,null,null,null,null,null,null,null,null,null,null,null,null,null,null,null,null,null,null,null,null,null,null,null,null,null,null,null,null,null,null,null,null,null,null,null,null,null,null,null,null,null,null,null,null,null,null,null,null,null,null,null,null,null,null,null,0,0,null,null,null,null,null,null,null,null,null,null,null,null,null,null,null,null,null,null,null,null,null,null,null,null,null,null,null,null,null,null,null,null,null,null,null,null,null,null,null,null,null,null,null,null,null,null,null,null,null,null,null,null,null,null,null,null,null,null,null,null,null,null,null,null,null,null,null,null,null,null,null,null,null,null,null,null,null,null,null,null,null,null,null,null,null,null,null,null,null,null,null,null,null,null,null,null,null,null,null,null,null,null,null,null,null,null,null,null,null,null,null,null,null,null,null,null,null,null,null,null,null,null,null,null,null,null,null,null,null,null,0,0]
[51,null,null,null,null,null,null,null,null,null,null,null,null,null,null,null,null,null,null,null,null,null,null,null,null,null,"",null,null,null,null,null,null,null,null,null,null,null,null,null,null,null,null,null,null,null,null,null,null,null,null,null,null,null,null,null,null,null,null,null,null,null,null,null,null,null,null,null,null,null,null,null,null,null,null,null,null,null,null,null,null,null,null,0,"","","","","","","","","","","","","","","","","","","","","","","","","","","","","","","","","","",null,null,null,null,null,"","","","","","","","",null,null,null,null,null,"","","","","","","","","",null,null,0,{"$f":"IF(Z60<>\"新規\",\"\",IF(AI60=3,基本!$E$14,IF(OR(AI60=1,AI60=2),基本!$E$13,\"\")))","v":""},{"$f":"IF(CF60=0,\"\",IF(AI60=3,基本!$E$16*CF60,IF(OR(AI60=1,AI60=2),基本!$E$15*CF60)))","v":""},{"$f":"IF(AJ60=\"\",\"\",IF(AJ60>0,基本!$E$17*CF60))","v":""},{"$f":"IF(ER60=0,\"\",IF(AM60<=4,基本!$E$18*ER60,IF(AM60>4,基本!$E$19*ER60)))","v":""},{"$f":"IF(AC60=\"\",\"\",IF(AC60>=1,基本!$E$20))","v":""},0,"","","","","","","",null,null,null,null,null,null,null,null,null,null,null,null,null,null,null,null,null,null,null,null,null,null,null,null,null,null,null,null,null,null,null,null,null,null,null,null,null,null,null,null,null,null,null,null,null,null,null,null,null,null,null,null,null,"","","","","","","","","","","","","","","","","","","","","","","","","","","","","","","","","","","","","","",null,null,"","","","","","","","","","","","","","","","","","","","","","","","","","","","","",null,null,null,null,null,null,null,null,null,null,null,null,null,null,null,null,null,null,null,null,null,null,null,null,null,null,null,null,null,null,null,null,null,null,null,null,null,null,null,null,null,null,null,null,null,null,null,null,null,null,null,null,null,null,null,null,null,null,null,null,null,null,null,null,null,null,null,null,null,null,null,null,null,null,null,null,null,null,null,null,null,null,null,null,null,null,null,null,null,null,null,null,null,null,null,null,null,null,null,null,null,null,null,null,null,null,null,null,null,null,null,null,null,null,null,null,null,null,null,null,null,null,null,null,null,null,null,null,null,null,null,null,null,null,null,0,0,null,null,null,null,null,null,null,null,null,null,null,null,null,null,null,null,null,null,null,null,null,null,null,null,null,null,null,null,null,null,null,null,null,null,null,null,null,null,null,null,null,null,null,null,null,null,null,null,null,null,null,null,null,null,null,null,null,null,null,null,null,null,null,null,null,null,null,null,null,null,null,null,null,null,null,null,null,null,null,null,null,null,null,null,null,null,null,null,null,null,null,null,null,null,null,null,null,null,null,null,null,null,null,null,null,null,null,null,null,null,null,null,null,null,null,null,null,null,null,null,null,null,null,null,null,null,null,null,null,null,0,0]
[52,null,null,null,null,null,null,null,null,null,null,null,null,null,null,null,null,null,null,null,null,null,null,null,null,null,"",null,null,null,null,null,null,null,null,null,null,null,null,null,null,null,null,null,null,null,null,null,null,null,null,null,null,null,null,null,null,null,null,null,null,null,null,null,null,null,null,null,null,null,null,null,null,null,null,null,null,null,null,null,null,null,null,0,"","","","","","","","","","","","","","","","","","","","","","","","","","","","","","","","","","",null,null,null,null,null,"","","","","","","","",null,null,null,null,null,"","","","","","","","","",null,null,0,{"$f":"IF(Z61<>\"新規\",\"\",IF(AI61=3,基本!$E$14,IF(OR(AI61=1,AI61=2),基本!$E$13,\"\")))","v":""},{"$f":"IF(CF61=0,\"\",IF(AI61=3,基本!$E$16*CF61,IF(OR(AI61=1,AI61=2),基本!$E$15*CF61)))","v":""},{"$f":"IF(AJ61=\"\",\"\",IF(AJ61>0,基本!$E$17*CF61))","v":""},{"$f":"IF(ER61=0,\"\",IF(AM61<=4,基本!$E$18*ER61,IF(AM61>4,基本!$E$19*ER61)))","v":""},{"$f":"IF(AC61=\"\",\"\",IF(AC61>=1,基本!$E$20))","v":""},0,"","","","","","","",null,null,null,null,null,null,null,null,null,null,null,null,null,null,null,null,null,null,null,null,null,null,null,null,null,null,null,null,null,null,null,null,null,null,null,null,null,null,null,null,null,null,null,null,null,null,null,null,null,null,null,null,null,"","","","","","","","","","","","","","","","","","","","","","","","","","","","","","","","","","","","","","",null,null,"","","","","","","","","","","","","","","","","","","","","","","","","","","","","",null,null,null,null,null,null,null,null,null,null,null,null,null,null,null,null,null,null,null,null,null,null,null,null,null,null,null,null,null,null,null,null,null,null,null,null,null,null,null,null,null,null,null,null,null,null,null,null,null,null,null,null,null,null,null,null,null,null,null,null,null,null,null,null,null,null,null,null,null,null,null,null,null,null,null,null,null,null,null,null,null,null,null,null,null,null,null,null,null,null,null,null,null,null,null,null,null,null,null,null,null,null,null,null,null,null,null,null,null,null,null,null,null,null,null,null,null,null,null,null,null,null,null,null,null,null,null,null,null,null,null,null,null,null,null,0,0,null,null,null,null,null,null,null,null,null,null,null,null,null,null,null,null,null,null,null,null,null,null,null,null,null,null,null,null,null,null,null,null,null,null,null,null,null,null,null,null,null,null,null,null,null,null,null,null,null,null,null,null,null,null,null,null,null,null,null,null,null,null,null,null,null,null,null,null,null,null,null,null,null,null,null,null,null,null,null,null,null,null,null,null,null,null,null,null,null,null,null,null,null,null,null,null,null,null,null,null,null,null,null,null,null,null,null,null,null,null,null,null,null,null,null,null,null,null,null,null,null,null,null,null,null,null,null,null,null,null,0,0]
[53,null,null,null,null,null,null,null,null,null,null,null,null,null,null,null,null,null,null,null,null,null,null,null,null,null,"",null,null,null,null,null,null,null,null,null,null,null,null,null,null,null,null,null,null,null,null,null,null,null,null,null,null,null,null,null,null,null,null,null,null,null,null,null,null,null,null,null,null,null,null,null,null,null,null,null,null,null,null,null,null,null,null,0,"","","","","","","","","","","","","","","","","","","","","","","","","","","","","","","","","","",null,null,null,null,null,"","","","","","","","",null,null,null,null,null,"","","","","","","","","",null,null,0,{"$f":"IF(Z62<>\"新規\",\"\",IF(AI62=3,基本!$E$14,IF(OR(AI62=1,AI62=2),基本!$E$13,\"\")))","v":""},{"$f":"IF(CF62=0,\"\",IF(AI62=3,基本!$E$16*CF62,IF(OR(AI62=1,AI62=2),基本!$E$15*CF62)))","v":""},{"$f":"IF(AJ62=\"\",\"\",IF(AJ62>0,基本!$E$17*CF62))","v":""},{"$f":"IF(ER62=0,\"\",IF(AM62<=4,基本!$E$18*ER62,IF(AM62>4,基本!$E$19*ER62)))","v":""},{"$f":"IF(AC62=\"\",\"\",IF(AC62>=1,基本!$E$20))","v":""},0,"","","","","","","",null,null,null,null,null,null,null,null,null,null,null,null,null,null,null,null,null,null,null,null,null,null,null,null,null,null,null,null,null,null,null,null,null,null,null,null,null,null,null,null,null,null,null,null,null,null,null,null,null,null,null,null,null,"","","","","","","","","","","","","","","","","","","","","","","","","","","","","","","","","","","","","","",null,null,"","","","","","","","","","","","","","","","","","","","","","","","","","","","","",null,null,null,null,null,null,null,null,null,null,null,null,null,null,null,null,null,null,null,null,null,null,null,null,null,null,null,null,null,null,null,null,null,null,null,null,null,null,null,null,null,null,null,null,null,null,null,null,null,null,null,null,null,null,null,null,null,null,null,null,null,null,null,null,null,null,null,null,null,null,null,null,null,null,null,null,null,null,null,null,null,null,null,null,null,null,null,null,null,null,null,null,null,null,null,null,null,null,null,null,null,null,null,null,null,null,null,null,null,null,null,null,null,null,null,null,null,null,null,null,null,null,null,null,null,null,null,null,null,null,null,null,null,null,null,0,0,null,null,null,null,null,null,null,null,null,null,null,null,null,null,null,null,null,null,null,null,null,null,null,null,null,null,null,null,null,null,null,null,null,null,null,null,null,null,null,null,null,null,null,null,null,null,null,null,null,null,null,null,null,null,null,null,null,null,null,null,null,null,null,null,null,null,null,null,null,null,null,null,null,null,null,null,null,null,null,null,null,null,null,null,null,null,null,null,null,null,null,null,null,null,null,null,null,null,null,null,null,null,null,null,null,null,null,null,null,null,null,null,null,null,null,null,null,null,null,null,null,null,null,null,null,null,null,null,null,null,0,0]
[54,null,null,null,null,null,null,null,null,null,null,null,null,null,null,null,null,null,null,null,null,null,null,null,null,null,"",null,null,null,null,null,null,null,null,null,null,null,null,null,null,null,null,null,null,null,null,null,null,null,null,null,null,null,null,null,null,null,null,null,null,null,null,null,null,null,null,null,null,null,null,null,null,null,null,null,null,null,null,null,null,null,null,0,"","","","","","","","","","","","","","","","","","","","","","","","","","","","","","","","","","",null,null,null,null,null,"","","","","","","","",null,null,null,null,null,"","","","","","","","","",null,null,0,{"$f":"IF(Z63<>\"新規\",\"\",IF(AI63=3,基本!$E$14,IF(OR(AI63=1,AI63=2),基本!$E$13,\"\")))","v":""},{"$f":"IF(CF63=0,\"\",IF(AI63=3,基本!$E$16*CF63,IF(OR(AI63=1,AI63=2),基本!$E$15*CF63)))","v":""},{"$f":"IF(AJ63=\"\",\"\",IF(AJ63>0,基本!$E$17*CF63))","v":""},{"$f":"IF(ER63=0,\"\",IF(AM63<=4,基本!$E$18*ER63,IF(AM63>4,基本!$E$19*ER63)))","v":""},{"$f":"IF(AC63=\"\",\"\",IF(AC63>=1,基本!$E$20))","v":""},0,"","","","","","","",null,null,null,null,null,null,null,null,null,null,null,null,null,null,null,null,null,null,null,null,null,null,null,null,null,null,null,null,null,null,null,null,null,null,null,null,null,null,null,null,null,null,null,null,null,null,null,null,null,null,null,null,null,"","","","","","","","","","","","","","","","","","","","","","","","","","","","","","","","","","","","","","",null,null,"","","","","","","","","","","","","","","","","","","","","","","","","","","","","",null,null,null,null,null,null,null,null,null,null,null,null,null,null,null,null,null,null,null,null,null,null,null,null,null,null,null,null,null,null,null,null,null,null,null,null,null,null,null,null,null,null,null,null,null,null,null,null,null,null,null,null,null,null,null,null,null,null,null,null,null,null,null,null,null,null,null,null,null,null,null,null,null,null,null,null,null,null,null,null,null,null,null,null,null,null,null,null,null,null,null,null,null,null,null,null,null,null,null,null,null,null,null,null,null,null,null,null,null,null,null,null,null,null,null,null,null,null,null,null,null,null,null,null,null,null,null,null,null,null,null,null,null,null,null,0,0,null,null,null,null,null,null,null,null,null,null,null,null,null,null,null,null,null,null,null,null,null,null,null,null,null,null,null,null,null,null,null,null,null,null,null,null,null,null,null,null,null,null,null,null,null,null,null,null,null,null,null,null,null,null,null,null,null,null,null,null,null,null,null,null,null,null,null,null,null,null,null,null,null,null,null,null,null,null,null,null,null,null,null,null,null,null,null,null,null,null,null,null,null,null,null,null,null,null,null,null,null,null,null,null,null,null,null,null,null,null,null,null,null,null,null,null,null,null,null,null,null,null,null,null,null,null,null,null,null,null,0,0]
[55,null,null,null,null,null,null,null,null,null,null,null,null,null,null,null,null,null,null,null,null,null,null,null,null,null,"",null,null,null,null,null,null,null,null,null,null,null,null,null,null,null,null,null,null,null,null,null,null,null,null,null,null,null,null,null,null,null,null,null,null,null,null,null,null,null,null,null,null,null,null,null,null,null,null,null,null,null,null,null,null,null,null,0,"","","","","","","","","","","","","","","","","","","","","","","","","","","","","","","","","","",null,null,null,null,null,"","","","","","","","",null,null,null,null,null,"","","","","","","","","",null,null,0,{"$f":"IF(Z64<>\"新規\",\"\",IF(AI64=3,基本!$E$14,IF(OR(AI64=1,AI64=2),基本!$E$13,\"\")))","v":""},{"$f":"IF(CF64=0,\"\",IF(AI64=3,基本!$E$16*CF64,IF(OR(AI64=1,AI64=2),基本!$E$15*CF64)))","v":""},{"$f":"IF(AJ64=\"\",\"\",IF(AJ64>0,基本!$E$17*CF64))","v":""},{"$f":"IF(ER64=0,\"\",IF(AM64<=4,基本!$E$18*ER64,IF(AM64>4,基本!$E$19*ER64)))","v":""},{"$f":"IF(AC64=\"\",\"\",IF(AC64>=1,基本!$E$20))","v":""},0,"","","","","","","",null,null,null,null,null,null,null,null,null,null,null,null,null,null,null,null,null,null,null,null,null,null,null,null,null,null,null,null,null,null,null,null,null,null,null,null,null,null,null,null,null,null,null,null,null,null,null,null,null,null,null,null,null,"","","","","","","","","","","","","","","","","","","","","","","","","","","","","","","","","","","","","","",null,null,"","","","","","","","","","","","","","","","","","","","","","","","","","","","","",null,null,null,null,null,null,null,null,null,null,null,null,null,null,null,null,null,null,null,null,null,null,null,null,null,null,null,null,null,null,null,null,null,null,null,null,null,null,null,null,null,null,null,null,null,null,null,null,null,null,null,null,null,null,null,null,null,null,null,null,null,null,null,null,null,null,null,null,null,null,null,null,null,null,null,null,null,null,null,null,null,null,null,null,null,null,null,null,null,null,null,null,null,null,null,null,null,null,null,null,null,null,null,null,null,null,null,null,null,null,null,null,null,null,null,null,null,null,null,null,null,null,null,null,null,null,null,null,null,null,null,null,null,null,null,0,0,null,null,null,null,null,null,null,null,null,null,null,null,null,null,null,null,null,null,null,null,null,null,null,null,null,null,null,null,null,null,null,null,null,null,null,null,null,null,null,null,null,null,null,null,null,null,null,null,null,null,null,null,null,null,null,null,null,null,null,null,null,null,null,null,null,null,null,null,null,null,null,null,null,null,null,null,null,null,null,null,null,null,null,null,null,null,null,null,null,null,null,null,null,null,null,null,null,null,null,null,null,null,null,null,null,null,null,null,null,null,null,null,null,null,null,null,null,null,null,null,null,null,null,null,null,null,null,null,null,null,0,0]
[56,null,null,null,null,null,null,null,null,null,null,null,null,null,null,null,null,null,null,null,null,null,null,null,null,null,"",null,null,null,null,null,null,null,null,null,null,null,null,null,null,null,null,null,null,null,null,null,null,null,null,null,null,null,null,null,null,null,null,null,null,null,null,null,null,null,null,null,null,null,null,null,null,null,null,null,null,null,null,null,null,null,null,0,"","","","","","","","","","","","","","","","","","","","","","","","","","","","","","","","","","",null,null,null,null,null,"","","","","","","","",null,null,null,null,null,"","","","","","","","","",null,null,0,{"$f":"IF(Z65<>\"新規\",\"\",IF(AI65=3,基本!$E$14,IF(OR(AI65=1,AI65=2),基本!$E$13,\"\")))","v":""},{"$f":"IF(CF65=0,\"\",IF(AI65=3,基本!$E$16*CF65,IF(OR(AI65=1,AI65=2),基本!$E$15*CF65)))","v":""},{"$f":"IF(AJ65=\"\",\"\",IF(AJ65>0,基本!$E$17*CF65))","v":""},{"$f":"IF(ER65=0,\"\",IF(AM65<=4,基本!$E$18*ER65,IF(AM65>4,基本!$E$19*ER65)))","v":""},{"$f":"IF(AC65=\"\",\"\",IF(AC65>=1,基本!$E$20))","v":""},0,"","","","","","","",null,null,null,null,null,null,null,null,null,null,null,null,null,null,null,null,null,null,null,null,null,null,null,null,null,null,null,null,null,null,null,null,null,null,null,null,null,null,null,null,null,null,null,null,null,null,null,null,null,null,null,null,null,"","","","","","","","","","","","","","","","","","","","","","","","","","","","","","","","","","","","","","",null,null,"","","","","","","","","","","","","","","","","","","","","","","","","","","","","",null,null,null,null,null,null,null,null,null,null,null,null,null,null,null,null,null,null,null,null,null,null,null,null,null,null,null,null,null,null,null,null,null,null,null,null,null,null,null,null,null,null,null,null,null,null,null,null,null,null,null,null,null,null,null,null,null,null,null,null,null,null,null,null,null,null,null,null,null,null,null,null,null,null,null,null,null,null,null,null,null,null,null,null,null,null,null,null,null,null,null,null,null,null,null,null,null,null,null,null,null,null,null,null,null,null,null,null,null,null,null,null,null,null,null,null,null,null,null,null,null,null,null,null,null,null,null,null,null,null,null,null,null,null,null,0,0,null,null,null,null,null,null,null,null,null,null,null,null,null,null,null,null,null,null,null,null,null,null,null,null,null,null,null,null,null,null,null,null,null,null,null,null,null,null,null,null,null,null,null,null,null,null,null,null,null,null,null,null,null,null,null,null,null,null,null,null,null,null,null,null,null,null,null,null,null,null,null,null,null,null,null,null,null,null,null,null,null,null,null,null,null,null,null,null,null,null,null,null,null,null,null,null,null,null,null,null,null,null,null,null,null,null,null,null,null,null,null,null,null,null,null,null,null,null,null,null,null,null,null,null,null,null,null,null,null,null,0,0]
[57,null,null,null,null,null,null,null,null,null,null,null,null,null,null,null,null,null,null,null,null,null,null,null,null,null,"",null,null,null,null,null,null,null,null,null,null,null,null,null,null,null,null,null,null,null,null,null,null,null,null,null,null,null,null,null,null,null,null,null,null,null,null,null,null,null,null,null,null,null,null,null,null,null,null,null,null,null,null,null,null,null,null,0,"","","","","","","","","","","","","","","","","","","","","","","","","","","","","","","","","","",null,null,null,null,null,"","","","","","","","",null,null,null,null,null,"","","","","","","","","",null,null,0,{"$f":"IF(Z66<>\"新規\",\"\",IF(AI66=3,基本!$E$14,IF(OR(AI66=1,AI66=2),基本!$E$13,\"\")))","v":""},{"$f":"IF(CF66=0,\"\",IF(AI66=3,基本!$E$16*CF66,IF(OR(AI66=1,AI66=2),基本!$E$15*CF66)))","v":""},{"$f":"IF(AJ66=\"\",\"\",IF(AJ66>0,基本!$E$17*CF66))","v":""},{"$f":"IF(ER66=0,\"\",IF(AM66<=4,基本!$E$18*ER66,IF(AM66>4,基本!$E$19*ER66)))","v":""},{"$f":"IF(AC66=\"\",\"\",IF(AC66>=1,基本!$E$20))","v":""},0,"","","","","","","",null,null,null,null,null,null,null,null,null,null,null,null,null,null,null,null,null,null,null,null,null,null,null,null,null,null,null,null,null,null,null,null,null,null,null,null,null,null,null,null,null,null,null,null,null,null,null,null,null,null,null,null,null,"","","","","","","","","","","","","","","","","","","","","","","","","","","","","","","","","","","","","","",null,null,"","","","","","","","","","","","","","","","","","","","","","","","","","","","","",null,null,null,null,null,null,null,null,null,null,null,null,null,null,null,null,null,null,null,null,null,null,null,null,null,null,null,null,null,null,null,null,null,null,null,null,null,null,null,null,null,null,null,null,null,null,null,null,null,null,null,null,null,null,null,null,null,null,null,null,null,null,null,null,null,null,null,null,null,null,null,null,null,null,null,null,null,null,null,null,null,null,null,null,null,null,null,null,null,null,null,null,null,null,null,null,null,null,null,null,null,null,null,null,null,null,null,null,null,null,null,null,null,null,null,null,null,null,null,null,null,null,null,null,null,null,null,null,null,null,null,null,null,null,null,0,0,null,null,null,null,null,null,null,null,null,null,null,null,null,null,null,null,null,null,null,null,null,null,null,null,null,null,null,null,null,null,null,null,null,null,null,null,null,null,null,null,null,null,null,null,null,null,null,null,null,null,null,null,null,null,null,null,null,null,null,null,null,null,null,null,null,null,null,null,null,null,null,null,null,null,null,null,null,null,null,null,null,null,null,null,null,null,null,null,null,null,null,null,null,null,null,null,null,null,null,null,null,null,null,null,null,null,null,null,null,null,null,null,null,null,null,null,null,null,null,null,null,null,null,null,null,null,null,null,null,null,0,0]
[58,null,null,null,null,null,null,null,null,null,null,null,null,null,null,null,null,null,null,null,null,null,null,null,null,null,"",null,null,null,null,null,null,null,null,null,null,null,null,null,null,null,null,null,null,null,null,null,null,null,null,null,null,null,null,null,null,null,null,null,null,null,null,null,null,null,null,null,null,null,null,null,null,null,null,null,null,null,null,null,null,null,null,0,"","","","","","","","","","","","","","","","","","","","","","","","","","","","","","","","","","",null,null,null,null,null,"","","","","","","","",null,null,null,null,null,"","","","","","","","","",null,null,0,{"$f":"IF(Z67<>\"新規\",\"\",IF(AI67=3,基本!$E$14,IF(OR(AI67=1,AI67=2),基本!$E$13,\"\")))","v":""},{"$f":"IF(CF67=0,\"\",IF(AI67=3,基本!$E$16*CF67,IF(OR(AI67=1,AI67=2),基本!$E$15*CF67)))","v":""},{"$f":"IF(AJ67=\"\",\"\",IF(AJ67>0,基本!$E$17*CF67))","v":""},{"$f":"IF(ER67=0,\"\",IF(AM67<=4,基本!$E$18*ER67,IF(AM67>4,基本!$E$19*ER67)))","v":""},{"$f":"IF(AC67=\"\",\"\",IF(AC67>=1,基本!$E$20))","v":""},0,"","","","","","","",null,null,null,null,null,null,null,null,null,null,null,null,null,null,null,null,null,null,null,null,null,null,null,null,null,null,null,null,null,null,null,null,null,null,null,null,null,null,null,null,null,null,null,null,null,null,null,null,null,null,null,null,null,"","","","","","","","","","","","","","","","","","","","","","","","","","","","","","","","","","","","","","",null,null,"","","","","","","","","","","","","","","","","","","","","","","","","","","","","",null,null,null,null,null,null,null,null,null,null,null,null,null,null,null,null,null,null,null,null,null,null,null,null,null,null,null,null,null,null,null,null,null,null,null,null,null,null,null,null,null,null,null,null,null,null,null,null,null,null,null,null,null,null,null,null,null,null,null,null,null,null,null,null,null,null,null,null,null,null,null,null,null,null,null,null,null,null,null,null,null,null,null,null,null,null,null,null,null,null,null,null,null,null,null,null,null,null,null,null,null,null,null,null,null,null,null,null,null,null,null,null,null,null,null,null,null,null,null,null,null,null,null,null,null,null,null,null,null,null,null,null,null,null,null,0,0,null,null,null,null,null,null,null,null,null,null,null,null,null,null,null,null,null,null,null,null,null,null,null,null,null,null,null,null,null,null,null,null,null,null,null,null,null,null,null,null,null,null,null,null,null,null,null,null,null,null,null,null,null,null,null,null,null,null,null,null,null,null,null,null,null,null,null,null,null,null,null,null,null,null,null,null,null,null,null,null,null,null,null,null,null,null,null,null,null,null,null,null,null,null,null,null,null,null,null,null,null,null,null,null,null,null,null,null,null,null,null,null,null,null,null,null,null,null,null,null,null,null,null,null,null,null,null,null,null,null,0,0]
[59,null,null,null,null,null,null,null,null,null,null,null,null,null,null,null,null,null,null,null,null,null,null,null,null,null,"",null,null,null,null,null,null,null,null,null,null,null,null,null,null,null,null,null,null,null,null,null,null,null,null,null,null,null,null,null,null,null,null,null,null,null,null,null,null,null,null,null,null,null,null,null,null,null,null,null,null,null,null,null,null,null,null,0,"","","","","","","","","","","","","","","","","","","","","","","","","","","","","","","","","","",null,null,null,null,null,"","","","","","","","",null,null,null,null,null,"","","","","","","","","",null,null,0,{"$f":"IF(Z68<>\"新規\",\"\",IF(AI68=3,基本!$E$14,IF(OR(AI68=1,AI68=2),基本!$E$13,\"\")))","v":""},{"$f":"IF(CF68=0,\"\",IF(AI68=3,基本!$E$16*CF68,IF(OR(AI68=1,AI68=2),基本!$E$15*CF68)))","v":""},{"$f":"IF(AJ68=\"\",\"\",IF(AJ68>0,基本!$E$17*CF68))","v":""},{"$f":"IF(ER68=0,\"\",IF(AM68<=4,基本!$E$18*ER68,IF(AM68>4,基本!$E$19*ER68)))","v":""},{"$f":"IF(AC68=\"\",\"\",IF(AC68>=1,基本!$E$20))","v":""},0,"","","","","","","",null,null,null,null,null,null,null,null,null,null,null,null,null,null,null,null,null,null,null,null,null,null,null,null,null,null,null,null,null,null,null,null,null,null,null,null,null,null,null,null,null,null,null,null,null,null,null,null,null,null,null,null,null,"","","","","","","","","","","","","","","","","","","","","","","","","","","","","","","","","","","","","","",null,null,"","","","","","","","","","","","","","","","","","","","","","","","","","","","","",null,null,null,null,null,null,null,null,null,null,null,null,null,null,null,null,null,null,null,null,null,null,null,null,null,null,null,null,null,null,null,null,null,null,null,null,null,null,null,null,null,null,null,null,null,null,null,null,null,null,null,null,null,null,null,null,null,null,null,null,null,null,null,null,null,null,null,null,null,null,null,null,null,null,null,null,null,null,null,null,null,null,null,null,null,null,null,null,null,null,null,null,null,null,null,null,null,null,null,null,null,null,null,null,null,null,null,null,null,null,null,null,null,null,null,null,null,null,null,null,null,null,null,null,null,null,null,null,null,null,null,null,null,null,null,0,0,null,null,null,null,null,null,null,null,null,null,null,null,null,null,null,null,null,null,null,null,null,null,null,null,null,null,null,null,null,null,null,null,null,null,null,null,null,null,null,null,null,null,null,null,null,null,null,null,null,null,null,null,null,null,null,null,null,null,null,null,null,null,null,null,null,null,null,null,null,null,null,null,null,null,null,null,null,null,null,null,null,null,null,null,null,null,null,null,null,null,null,null,null,null,null,null,null,null,null,null,null,null,null,null,null,null,null,null,null,null,null,null,null,null,null,null,null,null,null,null,null,null,null,null,null,null,null,null,null,null,0,0]
[60,null,null,null,null,null,null,null,null,null,null,null,null,null,null,null,null,null,null,null,null,null,null,null,null,null,"",null,null,null,null,null,null,null,null,null,null,null,null,null,null,null,null,null,null,null,null,null,null,null,null,null,null,null,null,null,null,null,null,null,null,null,null,null,null,null,null,null,null,null,null,null,null,null,null,null,null,null,null,null,null,null,null,0,"","","","","","","","","","","","","","","","","","","","","","","","","","","","","","","","","","",null,null,null,null,null,"","","","","","","","",null,null,null,null,null,"","","","","","","","","",null,null,0,{"$f":"IF(Z69<>\"新規\",\"\",IF(AI69=3,基本!$E$14,IF(OR(AI69=1,AI69=2),基本!$E$13,\"\")))","v":""},{"$f":"IF(CF69=0,\"\",IF(AI69=3,基本!$E$16*CF69,IF(OR(AI69=1,AI69=2),基本!$E$15*CF69)))","v":""},{"$f":"IF(AJ69=\"\",\"\",IF(AJ69>0,基本!$E$17*CF69))","v":""},{"$f":"IF(ER69=0,\"\",IF(AM69<=4,基本!$E$18*ER69,IF(AM69>4,基本!$E$19*ER69)))","v":""},{"$f":"IF(AC69=\"\",\"\",IF(AC69>=1,基本!$E$20))","v":""},0,"","","","","","","",null,null,null,null,null,null,null,null,null,null,null,null,null,null,null,null,null,null,null,null,null,null,null,null,null,null,null,null,null,null,null,null,null,null,null,null,null,null,null,null,null,null,null,null,null,null,null,null,null,null,null,null,null,"","","","","","","","","","","","","","","","","","","","","","","","","","","","","","","","","","","","","","",null,null,"","","","","","","","","","","","","","","","","","","","","","","","","","","","","",null,null,null,null,null,null,null,null,null,null,null,null,null,null,null,null,null,null,null,null,null,null,null,null,null,null,null,null,null,null,null,null,null,null,null,null,null,null,null,null,null,null,null,null,null,null,null,null,null,null,null,null,null,null,null,null,null,null,null,null,null,null,null,null,null,null,null,null,null,null,null,null,null,null,null,null,null,null,null,null,null,null,null,null,null,null,null,null,null,null,null,null,null,null,null,null,null,null,null,null,null,null,null,null,null,null,null,null,null,null,null,null,null,null,null,null,null,null,null,null,null,null,null,null,null,null,null,null,null,null,null,null,null,null,null,0,0,null,null,null,null,null,null,null,null,null,null,null,null,null,null,null,null,null,null,null,null,null,null,null,null,null,null,null,null,null,null,null,null,null,null,null,null,null,null,null,null,null,null,null,null,null,null,null,null,null,null,null,null,null,null,null,null,null,null,null,null,null,null,null,null,null,null,null,null,null,null,null,null,null,null,null,null,null,null,null,null,null,null,null,null,null,null,null,null,null,null,null,null,null,null,null,null,null,null,null,null,null,null,null,null,null,null,null,null,null,null,null,null,null,null,null,null,null,null,null,null,null,null,null,null,null,null,null,null,null,null,0,0]
[61,null,null,null,null,null,null,null,null,null,null,null,null,null,null,null,null,null,null,null,null,null,null,null,null,null,"",null,null,null,null,null,null,null,null,null,null,null,null,null,null,null,null,null,null,null,null,null,null,null,null,null,null,null,null,null,null,null,null,null,null,null,null,null,null,null,null,null,null,null,null,null,null,null,null,null,null,null,null,null,null,null,null,0,"","","","","","","","","","","","","","","","","","","","","","","","","","","","","","","","","","",null,null,null,null,null,"","","","","","","","",null,null,null,null,null,"","","","","","","","","",null,null,0,{"$f":"IF(Z70<>\"新規\",\"\",IF(AI70=3,基本!$E$14,IF(OR(AI70=1,AI70=2),基本!$E$13,\"\")))","v":""},{"$f":"IF(CF70=0,\"\",IF(AI70=3,基本!$E$16*CF70,IF(OR(AI70=1,AI70=2),基本!$E$15*CF70)))","v":""},{"$f":"IF(AJ70=\"\",\"\",IF(AJ70>0,基本!$E$17*CF70))","v":""},{"$f":"IF(ER70=0,\"\",IF(AM70<=4,基本!$E$18*ER70,IF(AM70>4,基本!$E$19*ER70)))","v":""},{"$f":"IF(AC70=\"\",\"\",IF(AC70>=1,基本!$E$20))","v":""},0,"","","","","","","",null,null,null,null,null,null,null,null,null,null,null,null,null,null,null,null,null,null,null,null,null,null,null,null,null,null,null,null,null,null,null,null,null,null,null,null,null,null,null,null,null,null,null,null,null,null,null,null,null,null,null,null,null,"","","","","","","","","","","","","","","","","","","","","","","","","","","","","","","","","","","","","","",null,null,"","","","","","","","","","","","","","","","","","","","","","","","","","","","","",null,null,null,null,null,null,null,null,null,null,null,null,null,null,null,null,null,null,null,null,null,null,null,null,null,null,null,null,null,null,null,null,null,null,null,null,null,null,null,null,null,null,null,null,null,null,null,null,null,null,null,null,null,null,null,null,null,null,null,null,null,null,null,null,null,null,null,null,null,null,null,null,null,null,null,null,null,null,null,null,null,null,null,null,null,null,null,null,null,null,null,null,null,null,null,null,null,null,null,null,null,null,null,null,null,null,null,null,null,null,null,null,null,null,null,null,null,null,null,null,null,null,null,null,null,null,null,null,null,null,null,null,null,null,null,0,0,null,null,null,null,null,null,null,null,null,null,null,null,null,null,null,null,null,null,null,null,null,null,null,null,null,null,null,null,null,null,null,null,null,null,null,null,null,null,null,null,null,null,null,null,null,null,null,null,null,null,null,null,null,null,null,null,null,null,null,null,null,null,null,null,null,null,null,null,null,null,null,null,null,null,null,null,null,null,null,null,null,null,null,null,null,null,null,null,null,null,null,null,null,null,null,null,null,null,null,null,null,null,null,null,null,null,null,null,null,null,null,null,null,null,null,null,null,null,null,null,null,null,null,null,null,null,null,null,null,null,0,0]
[62,null,null,null,null,null,null,null,null,null,null,null,null,null,null,null,null,null,null,null,null,null,null,null,null,null,"",null,null,null,null,null,null,null,null,null,null,null,null,null,null,null,null,null,null,null,null,null,null,null,null,null,null,null,null,null,null,null,null,null,null,null,null,null,null,null,null,null,null,null,null,null,null,null,null,null,null,null,null,null,null,null,null,0,"","","","","","","","","","","","","","","","","","","","","","","","","","","","","","","","","","",null,null,null,null,null,"","","","","","","","",null,null,null,null,null,"","","","","","","","","",null,null,0,{"$f":"IF(Z71<>\"新規\",\"\",IF(AI71=3,基本!$E$14,IF(OR(AI71=1,AI71=2),基本!$E$13,\"\")))","v":""},{"$f":"IF(CF71=0,\"\",IF(AI71=3,基本!$E$16*CF71,IF(OR(AI71=1,AI71=2),基本!$E$15*CF71)))","v":""},{"$f":"IF(AJ71=\"\",\"\",IF(AJ71>0,基本!$E$17*CF71))","v":""},{"$f":"IF(ER71=0,\"\",IF(AM71<=4,基本!$E$18*ER71,IF(AM71>4,基本!$E$19*ER71)))","v":""},{"$f":"IF(AC71=\"\",\"\",IF(AC71>=1,基本!$E$20))","v":""},0,"","","","","","","",null,null,null,null,null,null,null,null,null,null,null,null,null,null,null,null,null,null,null,null,null,null,null,null,null,null,null,null,null,null,null,null,null,null,null,null,null,null,null,null,null,null,null,null,null,null,null,null,null,null,null,null,null,"","","","","","","","","","","","","","","","","","","","","","","","","","","","","","","","","","","","","","",null,null,"","","","","","","","","","","","","","","","","","","","","","","","","","","","","",null,null,null,null,null,null,null,null,null,null,null,null,null,null,null,null,null,null,null,null,null,null,null,null,null,null,null,null,null,null,null,null,null,null,null,null,null,null,null,null,null,null,null,null,null,null,null,null,null,null,null,null,null,null,null,null,null,null,null,null,null,null,null,null,null,null,null,null,null,null,null,null,null,null,null,null,null,null,null,null,null,null,null,null,null,null,null,null,null,null,null,null,null,null,null,null,null,null,null,null,null,null,null,null,null,null,null,null,null,null,null,null,null,null,null,null,null,null,null,null,null,null,null,null,null,null,null,null,null,null,null,null,null,null,null,0,0,null,null,null,null,null,null,null,null,null,null,null,null,null,null,null,null,null,null,null,null,null,null,null,null,null,null,null,null,null,null,null,null,null,null,null,null,null,null,null,null,null,null,null,null,null,null,null,null,null,null,null,null,null,null,null,null,null,null,null,null,null,null,null,null,null,null,null,null,null,null,null,null,null,null,null,null,null,null,null,null,null,null,null,null,null,null,null,null,null,null,null,null,null,null,null,null,null,null,null,null,null,null,null,null,null,null,null,null,null,null,null,null,null,null,null,null,null,null,null,null,null,null,null,null,null,null,null,null,null,null,0,0]
[63,null,null,null,null,null,null,null,null,null,null,null,null,null,null,null,null,null,null,null,null,null,null,null,null,null,"",null,null,null,null,null,null,null,null,null,null,null,null,null,null,null,null,null,null,null,null,null,null,null,null,null,null,null,null,null,null,null,null,null,null,null,null,null,null,null,null,null,null,null,null,null,null,null,null,null,null,null,null,null,null,null,null,0,"","","","","","","","","","","","","","","","","","","","","","","","","","","","","","","","","","",null,null,null,null,null,"","","","","","","","",null,null,null,null,null,"","","","","","","","","",null,null,0,{"$f":"IF(Z72<>\"新規\",\"\",IF(AI72=3,基本!$E$14,IF(OR(AI72=1,AI72=2),基本!$E$13,\"\")))","v":""},{"$f":"IF(CF72=0,\"\",IF(AI72=3,基本!$E$16*CF72,IF(OR(AI72=1,AI72=2),基本!$E$15*CF72)))","v":""},{"$f":"IF(AJ72=\"\",\"\",IF(AJ72>0,基本!$E$17*CF72))","v":""},{"$f":"IF(ER72=0,\"\",IF(AM72<=4,基本!$E$18*ER72,IF(AM72>4,基本!$E$19*ER72)))","v":""},{"$f":"IF(AC72=\"\",\"\",IF(AC72>=1,基本!$E$20))","v":""},0,"","","","","","","",null,null,null,null,null,null,null,null,null,null,null,null,null,null,null,null,null,null,null,null,null,null,null,null,null,null,null,null,null,null,null,null,null,null,null,null,null,null,null,null,null,null,null,null,null,null,null,null,null,null,null,null,null,"","","","","","","","","","","","","","","","","","","","","","","","","","","","","","","","","","","","","","",null,null,"","","","","","","","","","","","","","","","","","","","","","","","","","","","","",null,null,null,null,null,null,null,null,null,null,null,null,null,null,null,null,null,null,null,null,null,null,null,null,null,null,null,null,null,null,null,null,null,null,null,null,null,null,null,null,null,null,null,null,null,null,null,null,null,null,null,null,null,null,null,null,null,null,null,null,null,null,null,null,null,null,null,null,null,null,null,null,null,null,null,null,null,null,null,null,null,null,null,null,null,null,null,null,null,null,null,null,null,null,null,null,null,null,null,null,null,null,null,null,null,null,null,null,null,null,null,null,null,null,null,null,null,null,null,null,null,null,null,null,null,null,null,null,null,null,null,null,null,null,null,0,0,null,null,null,null,null,null,null,null,null,null,null,null,null,null,null,null,null,null,null,null,null,null,null,null,null,null,null,null,null,null,null,null,null,null,null,null,null,null,null,null,null,null,null,null,null,null,null,null,null,null,null,null,null,null,null,null,null,null,null,null,null,null,null,null,null,null,null,null,null,null,null,null,null,null,null,null,null,null,null,null,null,null,null,null,null,null,null,null,null,null,null,null,null,null,null,null,null,null,null,null,null,null,null,null,null,null,null,null,null,null,null,null,null,null,null,null,null,null,null,null,null,null,null,null,null,null,null,null,null,null,0,0]
[64,null,null,null,null,null,null,null,null,null,null,null,null,null,null,null,null,null,null,null,null,null,null,null,null,null,{"$f":"IF(LEFT(V73,3)=\"神経痛\",1,IF(LEFT(V73,3)=\"リウマ\",2,IF(LEFT(V73,3)=\"頚腕症\",3,IF(LEFT(V73,3)=\"五十肩\",4,IF(LEFT(V73,3)=\"腰痛症\",5,IF(LEFT(V73,3)=\"頚椎捻\",6,\"\"))))))","v":""},null,null,null,null,null,null,null,null,null,null,null,null,null,null,null,null,null,null,null,null,null,null,null,null,null,null,null,null,null,null,null,null,null,null,null,null,null,null,null,null,null,null,null,null,null,null,null,null,null,null,null,null,null,null,null,null,0,"","","","","","","","","","","","","","","","","","","","","","","","","","","","","","","","","","",null,null,null,null,null,"","","","","","","","",null,null,null,null,null,"","","","","","","","","",null,null,0,{"$f":"IF(Z73<>\"新規\",\"\",IF(AI73=3,基本!$E$14,IF(OR(AI73=1,AI73=2),基本!$E$13,\"\")))","v":""},{"$f":"IF(CF73=0,\"\",IF(AI73=3,基本!$E$16*CF73,IF(OR(AI73=1,AI73=2),基本!$E$15*CF73)))","v":""},{"$f":"IF(AJ73=\"\",\"\",IF(AJ73>0,基本!$E$17*CF73))","v":""},{"$f":"IF(ER73=0,\"\",IF(AM73<=4,基本!$E$18*ER73,IF(AM73>4,基本!$E$19*ER73)))","v":""},{"$f":"IF(AC73=\"\",\"\",IF(AC73>=1,基本!$E$20))","v":""},0,"","","","","","","",null,null,null,null,null,null,null,null,null,null,null,null,null,null,null,null,null,null,null,null,null,null,null,null,null,null,null,null,null,null,null,null,null,null,null,null,null,null,null,null,null,null,null,null,null,null,null,null,null,null,null,null,null,"","","","","","","","","","","","","","","","","","","","","","","","","","","","","","","","","","","","","","",null,null,"","","","","","","","","","","","","","","","","","","","","","","","","","","","","",null,null,null,null,null,null,null,null,null,null,null,null,null,null,null,null,null,null,null,null,null,null,null,null,null,null,null,null,null,null,null,null,null,null,null,null,null,null,null,null,null,null,null,null,null,null,null,null,null,null,null,null,null,null,null,null,null,null,null,null,null,null,null,null,null,null,null,null,null,null,null,null,null,null,null,null,null,null,null,null,null,null,null,null,null,null,null,null,null,null,null,null,null,null,null,null,null,null,null,null,null,null,null,null,null,null,null,null,null,null,null,null,null,null,null,null,null,null,null,null,null,null,null,null,null,null,null,null,null,null,null,null,null,null,null,0,0,null,null,null,null,null,null,null,null,null,null,null,null,null,null,null,null,null,null,null,null,null,null,null,null,null,null,null,null,null,null,null,null,null,null,null,null,null,null,null,null,null,null,null,null,null,null,null,null,null,null,null,null,null,null,null,null,null,null,null,null,null,null,null,null,null,null,null,null,null,null,null,null,null,null,null,null,null,null,null,null,null,null,null,null,null,null,null,null,null,null,null,null,null,null,null,null,null,null,null,null,null,null,null,null,null,null,null,null,null,null,null,null,null,null,null,null,null,null,null,null,null,null,null,null,null,null,null,null,null,null,0,0]
[65,null,null,null,null,null,null,null,null,null,null,null,null,null,null,null,null,null,null,null,null,null,null,null,null,null,"",null,null,null,null,null,null,null,null,null,null,null,null,null,null,null,null,null,null,null,null,null,null,null,null,null,null,null,null,null,null,null,null,null,null,null,null,null,null,null,null,null,null,null,null,null,null,null,null,null,null,null,null,null,null,null,null,0,"","","","","","","","","","","","","","","","","","","","","","","","","","","","","","","","","","",null,null,null,null,null,"","","","","","","","",null,null,null,null,null,"","","","","","","","","",null,null,0,{"$f":"IF(Z74<>\"新規\",\"\",IF(AI74=3,基本!$E$14,IF(OR(AI74=1,AI74=2),基本!$E$13,\"\")))","v":""},{"$f":"IF(CF74=0,\"\",IF(AI74=3,基本!$E$16*CF74,IF(OR(AI74=1,AI74=2),基本!$E$15*CF74)))","v":""},{"$f":"IF(AJ74=\"\",\"\",IF(AJ74>0,基本!$E$17*CF74))","v":""},{"$f":"IF(ER74=0,\"\",IF(AM74<=4,基本!$E$18*ER74,IF(AM74>4,基本!$E$19*ER74)))","v":""},{"$f":"IF(AC74=\"\",\"\",IF(AC74>=1,基本!$E$20))","v":""},0,{"$f":"IF($E74=\"\",\"\",IF($E74=\"協会けんぽ\",$EX74,\"\"))","v":""},{"$f":"IF($E74=\"\",\"\",IF($E74=\"健保組合\",$EX74,\"\"))","v":""},{"$f":"IF($E74=\"\",\"\",IF($E74=\"国保一般\",$EX74,\"\"))","v":""},{"$f":"IF($E74=\"\",\"\",IF($E74=\"後期高齢者\",$EX74,\"\"))","v":""},{"$f":"IF($E74=\"\",\"\",IF($E74=\"共済組合\",$EX74,\"\"))","v":""},{"$f":"IF($E74=\"\",\"\",IF($E74=\"退職者国保\",$EX74,\"\"))","v":""},{"$f":"IF($E74=\"\",\"\",IF($E74=\"国保組合\",$EX74,\"\"))","v":""},null,null,null,null,null,null,null,null,null,null,null,null,null,null,null,null,null,null,null,null,null,null,null,null,null,null,null,null,null,null,null,null,null,null,null,null,null,null,null,null,null,null,null,null,null,null,null,null,null,null,null,null,null,{"$f":"IF(AT74=0,\"\",AT74)","v":""},"",{"$f":"MID(HG74,2,2)","v":""},{"$f":"MID(HG74,5,2)","v":""},{"$f":"MID(HG74,8,2)","v":""},"","","","","","","","","","","","","","","","","","","","","","","","","","","","","","","","","",null,null,"","","","","","","","","","","","","","","","","","","","","","","","","","","","","",null,null,null,null,null,null,null,null,null,null,null,null,null,null,null,null,null,null,null,null,null,null,null,null,null,null,null,null,null,null,null,null,null,null,null,null,null,null,null,null,null,null,null,null,null,null,null,null,null,null,null,null,null,null,null,null,null,null,null,null,null,null,null,null,null,null,null,null,null,null,null,null,null,null,null,null,null,null,null,null,null,null,null,null,null,null,null,null,null,null,null,null,null,null,null,null,null,null,null,null,null,null,null,null,null,null,null,null,null,null,null,null,null,null,null,null,null,null,null,null,null,null,null,null,null,null,null,null,null,null,null,null,null,null,null,0,0,null,null,null,null,null,null,null,null,null,null,null,null,null,null,null,null,null,null,null,null,null,null,null,null,null,null,null,null,null,null,null,null,null,null,null,null,null,null,null,null,null,null,null,null,null,null,null,null,null,null,null,null,null,null,null,null,null,null,null,null,null,null,null,null,null,null,null,null,null,null,null,null,null,null,null,null,null,null,null,null,null,null,null,null,null,null,null,null,null,null,null,null,null,null,null,null,null,null,null,null,null,null,null,null,null,null,null,null,null,null,null,null,null,null,null,null,null,null,null,null,null,null,null,null,null,null,null,null,null,null,0,0]
[66,null,null,null,null,null,null,null,null,null,null,null,null,null,null,null,null,null,null,null,null,null,null,null,null,null,"",null,null,null,null,null,null,null,null,null,null,null,null,null,null,null,null,null,null,null,null,null,null,null,null,null,null,null,null,null,null,null,null,null,null,null,null,null,null,null,null,null,null,null,null,null,null,null,null,null,null,null,null,null,null,null,null,{"$f":"COUNTA(BA75:CE75)","v":0},{"$f":"IF(K75=0,\"\",K75)","v":""},{"$f":"IF(G75=0,\"\",G75)","v":""},{"$f":"IF(LEN(CH75)=0,\"\",LEN(CH75))","v":""},{"$f":"IF(CI75=2,LEFT(CH75),\"\")","v":""},{"$f":"IF(CH75=\"\",\"\",RIGHT(CH75))","v":""},{"$f":"IF(H75=0,\"\",H75)","v":""},{"$f":"IF(LEN(CL75)=0,\"\",LEN(CL75))","v":""},{"$f":"IF(CM75=3,LEFT(CL75),\"\")","v":""},{"$f":"IF(CM75=3,MID(CL75,2,1),IF(CM75=2,LEFT(CL75),\"\"))","v":""},{"$f":"RIGHT(CL75)","v":""},{"$f":"IF(I75=0,\"\",I75)","v":""},{"$f":"IF(LEN(CQ75)=0,\"\",LEN(CQ75))","v":""},{"$f":"IF(CR75=7,LEFT(CQ75),\"\")","v":""},{"$f":"IF(CR75=6,MID(CQ75,2,1),IF(CR75=5,LEFT(CQ75),\"\"))","v":""},{"$f":"IF(CR75=6,MID(CQ75,3,1),IF(CR75=5,MID(CQ75,2,1),IF(CR75=4,LEFT(CQ75),\"\")))","v":""},{"$f":"IF(CR75=6,MID(CQ75,4,1),IF(CR75=5,MID(CQ75,3,1),IF(CR75=4,MID(CQ75,2,1),IF(CR75=3,LEFT(CQ75),\"\"))))","v":""},{"$f":"IF(CR75=6,MID(CQ75,5,1),IF(CR75=5,MID(CQ75,4,1),IF(CR75=4,MID(CQ75,3,1),IF(CR75=3,MID(CQ75,2,1),IF(CR75=2,LEFT(CQ75),\"\")))))","v":""},{"$f":"IF(RIGHT(CR75)=0,\"\",RIGHT(CQ75))","v":""},{"$f":"IF(T75=0,\"\",T75)","v":""},{"$f":"LEFT(CY75)","v":""},{"$f":"MID(CY75,2,2)","v":""},{"$f":"MID(CY75,5,2)","v":""},{"$f":"MID(CY75,8,2)","v":""},{"$f":"IF($CZ75=\"T\",1911,IF($CZ75=\"S\",1925,IF($CZ75=\"H\",1988,IF($CZ75=\"R\",2018,\"\"))))","v":""},{"$f":"IF(DD75=\"\",\"\",DD75+DA75)","v":""},{"$f":"IF(DD75=\"\",\"\",DATE(DE75,DB75,DC75))","v":""},{"$f":"IF(DD75=\"\",\"\",DATEDIF(DF75,TODAY(),\"Y\"))","v":""},{"$f":"LEFT(DG75)","v":""},{"$f":"MID(DG75,2,1)","v":""},{"$f":"MID(DG75,3,1)","v":""},{"$f":"MID(DG75,5,1)","v":""},{"$f":"MID(DG75,6,1)","v":""},{"$f":"MID(DG75,7,1)","v":""},{"$f":"MID(DG75,8,1)","v":""},null,null,null,null,null,{"$f":"IF(Y75=0,\"\",Y75)","v":""},{"$f":"LEFT(DT75)","v":""},{"$f":"MID(DT75,2,2)","v":""},{"$f":"MID(DT75,5,2)","v":""},{"$f":"MID(DT75,8,2)","v":""},{"$f":"IF(DW75=\"\",\"\",VALUE(DW75))","v":""},{"$f":"IF(DV75=\"\",\"\",IF(VALUE(DV75)=$CW$6,IF(VALUE(DW75)=$CW$5,DX75,1),1))","v":""},{"$f":"IF(DV75=\"\",\"\",$CZ$5)","v":""},null,null,null,null,null,{"$f":"IF(DZ75=1,0,LEFT(DZ75))","v":""},{"$f":"IF(DZ75=1,1,RIGHT(DZ75))","v":""},{"$f":"LEFT(EA75)","v":""},{"$f":"MID(EA75,2,1)","v":""},{"$f":"IF(W75=0,\"\",W75)","v":""},{"$f":"IF(EK75=\"不詳\",\"\",IF(EK75=\"不明\",\"\",MID(EK75,2,2)))","v":""},{"$f":"MID(EK75,5,2)","v":""},{"$f":"MID(EK75,8,2)","v":""},{"$f":"LEFT(EK75)","v":""},null,null,{"$f":"COUNTIF(BA75:CE75,\"◎\")","v":0},{"$f":"IF(Z75<>\"新規\",\"\",IF(AI75=3,基本!$E$14,IF(OR(AI75=1,AI75=2),基本!$E$13,\"\")))","v":""},{"$f":"IF(CF75=0,\"\",IF(AI75=3,基本!$E$16*CF75,IF(OR(AI75=1,AI75=2),基本!$E$15*CF75)))","v":""},{"$f":"IF(AJ75=\"\",\"\",IF(AJ75>0,基本!$E$17*CF75))","v":""},{"$f":"IF(ER75=0,\"\",IF(AM75<=4,基本!$E$18*ER75,IF(AM75>4,基本!$E$19*ER75)))","v":""},{"$f":"IF(AC75=\"\",\"\",IF(AC75>=1,基本!$E$20))","v":""},{"$f":"SUM(ES75:EW75)","v":0},"","","","","","","",null,null,null,null,null,null,null,null,null,null,null,null,null,null,null,null,null,null,null,null,null,null,null,null,null,null,null,null,null,null,null,null,null,null,null,null,null,null,null,null,null,null,null,null,null,null,null,null,null,null,null,null,null,"",{"$f":"LEFT(HG75,1)","v":""},"","","",{"$f":"IF(LEFT(V75,3)=\"神経痛\",1,IF(LEFT(V75,3)=\"リウマ\",2,IF(LEFT(V75,3)=\"頚腕症\",3,IF(LEFT(V75,3)=\"五十肩\",4,IF(LEFT(V75,3)=\"腰痛症\",5,IF(LEFT(V75,3)=\"頚椎捻\",6,\"\"))))))","v":""},{"$f":"IF(OR(BA75=\"○\",BA75=\"◎\"),1,\"\")","v":""},{"$f":"IF(OR(BB75=\"○\",BB75=\"◎\"),2,\"\")","v":""},{"$f":"IF(OR(BC75=\"○\",BC75=\"◎\"),3,\"\")","v":""},{"$f":"IF(OR(BD75=\"○\",BD75=\"◎\"),4,\"\")","v":""},{"$f":"IF(OR(BE75=\"○\",BE75=\"◎\"),5,\"\")","v":""},{"$f":"IF(OR(BF75=\"○\",BF75=\"◎\"),6,\"\")","v":""},{"$f":"IF(OR(BG75=\"○\",BG75=\"◎\"),7,\"\")","v":""},{"$f":"IF(OR(BH75=\"○\",BH75=\"◎\"),8,\"\")","v":""},{"$f":"IF(OR(BI75=\"○\",BI75=\"◎\"),9,\"\")","v":""},{"$f":"IF(OR(BJ75=\"○\",BJ75=\"◎\"),10,\"\")","v":""},{"$f":"IF(OR(BK75=\"○\",BK75=\"◎\"),11,\"\")","v":""},{"$f":"IF(OR(BL75=\"○\",BL75=\"◎\"),12,\"\")","v":""},{"$f":"IF(OR(BM75=\"○\",BM75=\"◎\"),13,\"\")","v":""},{"$f":"IF(OR(BN75=\"○\",BN75=\"◎\"),14,\"\")","v":""},{"$f":"IF(OR(BO75=\"○\",BO75=\"◎\"),15,\"\")","v":""},{"$f":"IF(OR(BP75=\"○\",BP75=\"◎\"),16,\"\")","v":""},{"$f":"IF(OR(BQ75=\"○\",BQ75=\"◎\"),17,\"\")","v":""},{"$f":"IF(OR(BR75=\"○\",BR75=\"◎\"),18,\"\")","v":""},{"$f":"IF(OR(BS75=\"○\",BS75=\"◎\"),19,\"\")","v":""},{"$f":"IF(OR(BT75=\"○\",BT75=\"◎\"),20,\"\")","v":""},{"$f":"IF(OR(BU75=\"○\",BU75=\"◎\"),21,\"\")","v":""},{"$f":"IF(OR(BV75=\"○\",BV75=\"◎\"),22,\"\")","v":""},{"$f":"IF(OR(BW75=\"○\",BW75=\"◎\"),23,\"\")","v":""},{"$f":"IF(OR(BX75=\"○\",BX75=\"◎\"),24,\"\")","v":""},{"$f":"IF(OR(BY75=\"○\",BY75=\"◎\"),25,\"\")","v":""},{"$f":"IF(OR(BZ75=\"○\",BZ75=\"◎\"),26,\"\")","v":""},{"$f":"IF(OR(CA75=\"○\",CA75=\"◎\"),27,\"\")","v":""},{"$f":"IF(OR(CB75=\"○\",CB75=\"◎\"),28,\"\")","v":""},{"$f":"IF(OR(CC75=\"○\",CC75=\"◎\"),29,\"\")","v":""},{"$f":"IF(OR(CD75=\"○\",CD75=\"◎\"),30,\"\")","v":""},{"$f":"IF(OR(CE75=\"○\",CE75=\"◎\"),31,\"\")","v":""},{"$f":"IF(MAX(HM75:IQ75)=0,\"\",MAX(HM75:IQ75))","v":""},null,null,{"$f":"IF(G75=\"\",\"\",G75)","v":""},{"$f":"IF(LEN(IU75)=0,\"\",LEN(IU75))","v":""},{"$f":"IF(IV75=8,LEFT(IU75),\"\")","v":""},{"$f":"IF(IV75=8,MID(IU75,2,1),IF(IV75=7,LEFT(IU75),\"\"))","v":""},{"$f":"IF(IV75=8,MID(IU75,3,1),IF(IV75=7,MID(IU75,2,1),IF(IV75=6,LEFT(IU75),\"\")))","v":""},{"$f":"IF(IV75=8,MID(IU75,4,1),IF(IV75=7,MID(IU75,3,1),IF(IV75=6,MID(IU75,2,1),IF(IV75=5,LEFT(IU75),\"\"))))","v":""},{"$f":"IF(IV75=8,MID(IU75,5,1),IF(IV75=7,MID(IU75,4,1),IF(IV75=6,MID(IU75,3,1),IF(IV75=5,MID(IU75,2,1),IF(IV75=4,LEFT(IU75),\"\")))))","v":""},{"$f":"IF(IV75=8,MID(IU75,6,1),IF(IV75=7,MID(IU75,5,1),IF(IV75=6,MID(IU75,4,1),IF(IV75=5,MID(IU75,3,1),IF(IV75=4,MID(IU75,2,1),IF(IV75=3,LEFT(IU75),\"\"))))))","v":""},{"$f":"IF(IV75=8,MID(IU75,7,1),IF(IV75=7,MID(IU75,6,1),IF(IV75=6,MID(IU75,5,1),IF(IV75=5,MID(IU75,4,1),IF(IV75=4,MID(IU75,3,1),IF(IV75=3,MID(IU75,2,1),IF(IV75=2,LEFT(IU75),\"\")))))))","v":""},{"$f":"IF(RIGHT(IV75)=0,\"\",RIGHT(IU75))","v":""},{"$f":"IF(H75=\"\",\"\",H75)","v":""},{"$f":"IF(LEN(JE75)=0,\"\",LEN(JE75))","v":""},{"$f":"IF(JF75=7,LEFT(JE75),\"\")","v":""},{"$f":"IF(JF75=7,MID(JE75,2,1),IF(JF75=6,LEFT(JE75),\"\"))","v":""},{"$f":"IF(JF75=7,MID(JE75,3,1),IF(JF75=6,MID(JE75,2,1),IF(JF75=5,LEFT(JE75,1),\"\")))","v":""},{"$f":"IF(JF75=7,MID(JE75,4,1),IF(JF75=6,MID(JE75,3,1),IF(JF75=5,MID(JE75,2,1),IF(JF75=4,LEFT(JE75,1),\"\"))))","v":""},{"$f":"IF(JF75=7,MID(JE75,5,1),IF(JF75=6,MID(JE75,4,1),IF(JF75=5,MID(JE75,3,1),IF(JF75=4,MID(JE75,2,1),IF(JF75=3,LEFT(JE75,1),\"\")))))","v":""},{"$f":"IF(JF75=7,MID(JE75,6,1),IF(JF75=6,MID(JE75,5,1),IF(JF75=5,MID(JE75,4,1),IF(JF75=4,MID(JE75,3,1),IF(JF75=3,MID(JE75,2,1),\"\")))))","v":""},{"$f":"IF(RIGHT(JE75)=0,\"\",RIGHT(JE75))","v":""},{"$f":"IF(B75=\"\",\"\",B75)","v":""},{"$f":"IF(LEN(JN75)=0,\"\",LEN(JN75))","v":""},{"$f":"IF(JO75=8,LEFT(JN75),\"\")","v":""},{"$f":"IF(JO75=8,MID(JN75,2,1),IF(JO75=7,LEFT(JN75),\"\"))","v":""},{"$f":"IF(JO75=8,MID(JN75,3,1),IF(JO75=7,MID(JN75,2,1),IF(JO75=6,LEFT(JN75),\"\")))","v":""},{"$f":"IF(JO75=8,MID(JN75,4,1),IF(JO75=7,MID(JN75,3,1),IF(JO75=6,MID(JN75,2,1),IF(JO75=5,LEFT(JN75),\"\"))))","v":""},{"$f":"IF(JO75=8,MID(JN75,5,1),IF(JO75=7,MID(JN75,4,1),IF(JO75=6,MID(JN75,3,1),IF(JO75=5,MID(JN75,2,1),IF(JO75=4,LEFT(JN75),\"\")))))","v":""},{"$f":"IF(JO75=8,MID(JN75,6,1),IF(JO75=7,MID(JN75,5,1),IF(JO75=6,MID(JN75,4,1),IF(JO75=5,MID(JN75,3,1),IF(JO75=4,MID(JN75,2,1),IF(JO75=3,LEFT(JN75),\"\"))))))","v":""},{"$f":"IF(JO75=8,MID(JN75,7,1),IF(JO75=7,MID(JN75,6,1),IF(JO75=6,MID(JN75,5,1),IF(JO75=5,MID(JN75,4,1),IF(JO75=4,MID(JN75,3,1),IF(JO75=3,MID(JN75,2,1),IF(JO75=2,LEFT(JN75),\"\")))))))","v":""},{"$f":"IF(RIGHT(JO75)=0,\"\",RIGHT(JN75))","v":""},null,null,null,null,null,null,null,null,null,null,null,null,null,null,null,null,null,null,null,null,null,null,null,null,null,null,null,null,null,null,null,null,null,null,null,null,null,null,null,null,null,null,null,null,null,null,null,null,null,null,null,null,null,null,null,null,null,null,null,null,null,null,null,null,null,null,null,null,null,null,null,null,null,null,null,null,null,null,null,null,null,null,null,null,null,null,null,null,null,null,null,null,null,null,null,null,null,null,null,null,null,null,null,null,null,null,null,null,null,null,null,null,null,null,null,null,null,null,null,null,null,null,null,null,null,null,null,null,null,null,null,null,null,null,null,0,0,null,null,null,null,null,null,null,null,null,null,null,null,null,null,null,null,null,null,null,null,null,null,null,null,null,null,null,null,null,null,null,null,null,null,null,null,null,null,null,null,null,null,null,null,null,null,null,null,null,null,null,null,null,null,null,null,null,null,null,null,null,null,null,null,null,null,null,null,null,null,null,null,null,null,null,null,null,null,null,null,null,null,null,null,null,null,null,null,null,null,null,null,null,null,null,null,null,null,null,null,null,null,null,null,null,null,null,null,null,null,null,null,null,null,null,null,null,null,null,null,null,null,null,null,null,null,null,null,null,null,0,0]
[67,null,null,null,null,null,null,null,null,null,null,null,null,null,null,null,null,null,null,null,null,null,null,null,null,null,"",null,null,null,null,null,null,null,null,null,null,null,null,null,null,null,null,null,null,null,null,null,null,null,null,null,null,null,null,null,null,null,null,null,null,null,null,null,null,null,null,null,null,null,null,null,null,null,null,null,null,null,null,null,null,null,null,0,"","","","","","","","","","","","","","","","","","","","","","","","","","","","","","","","","","",null,null,null,null,null,"","","","","","","","",null,null,null,null,null,"","","","","","","","","",null,null,0,{"$f":"IF(Z76<>\"新規\",\"\",IF(AI76=3,基本!$E$14,IF(OR(AI76=1,AI76=2),基本!$E$13,\"\")))","v":""},{"$f":"IF(CF76=0,\"\",IF(AI76=3,基本!$E$16*CF76,IF(OR(AI76=1,AI76=2),基本!$E$15*CF76)))","v":""},{"$f":"IF(AJ76=\"\",\"\",IF(AJ76>0,基本!$E$17*CF76))","v":""},{"$f":"IF(ER76=0,\"\",IF(AM76<=4,基本!$E$18*ER76,IF(AM76>4,基本!$E$19*ER76)))","v":""},{"$f":"IF(AC76=\"\",\"\",IF(AC76>=1,基本!$E$20))","v":""},0,"","","","","","","",null,null,null,null,null,null,null,null,null,null,null,null,null,null,null,null,null,null,null,null,null,null,null,null,null,null,null,null,null,null,null,null,null,null,null,null,null,null,null,null,null,null,null,null,null,null,null,null,null,null,null,null,null,"","","","","","","","","","","","","","","","","","","","","","","","","","","","","","","","","","","","","","",null,null,"","","","","","","","","","","","","","","","","","","","","","","","","","","","","",null,null,null,null,null,null,null,null,null,null,null,null,null,null,null,null,null,null,null,null,null,null,null,null,null,null,null,null,null,null,null,null,null,null,null,null,null,null,null,null,null,null,null,null,null,null,null,null,null,null,null,null,null,null,null,null,null,null,null,null,null,null,null,null,null,null,null,null,null,null,null,null,null,null,null,null,null,null,null,null,null,null,null,null,null,null,null,null,null,null,null,null,null,null,null,null,null,null,null,null,null,null,null,null,null,null,null,null,null,null,null,null,null,null,null,null,null,null,null,null,null,null,null,null,null,null,null,null,null,null,null,null,null,null,null,0,0,null,null,null,null,null,null,null,null,null,null,null,null,null,null,null,null,null,null,null,null,null,null,null,null,null,null,null,null,null,null,null,null,null,null,null,null,null,null,null,null,null,null,null,null,null,null,null,null,null,null,null,null,null,null,null,null,null,null,null,null,null,null,null,null,null,null,null,null,null,null,null,null,null,null,null,null,null,null,null,null,null,null,null,null,null,null,null,null,null,null,null,null,null,null,null,null,null,null,null,null,null,null,null,null,null,null,null,null,null,null,null,null,null,null,null,null,null,null,null,null,null,null,null,null,null,null,null,null,null,null,0,0]
[68,null,null,null,null,null,null,null,null,null,null,null,null,null,null,null,null,null,null,null,null,null,null,null,null,null,"",null,null,null,null,null,null,null,null,null,null,null,null,null,null,null,null,null,null,null,null,null,null,null,null,null,null,null,null,null,null,null,null,null,null,null,null,null,null,null,null,null,null,null,null,null,null,null,null,null,null,null,null,null,null,null,null,0,"","","","","","","","","","","","","","","","","","","","","","","","","","","","","","","","","","",null,null,null,null,null,"","","","","","","","",null,null,null,null,null,"","","","","","","","","",null,null,0,{"$f":"IF(Z77<>\"新規\",\"\",IF(AI77=3,基本!$E$14,IF(OR(AI77=1,AI77=2),基本!$E$13,\"\")))","v":""},{"$f":"IF(CF77=0,\"\",IF(AI77=3,基本!$E$16*CF77,IF(OR(AI77=1,AI77=2),基本!$E$15*CF77)))","v":""},{"$f":"IF(AJ77=\"\",\"\",IF(AJ77>0,基本!$E$17*CF77))","v":""},{"$f":"IF(ER77=0,\"\",IF(AM77<=4,基本!$E$18*ER77,IF(AM77>4,基本!$E$19*ER77)))","v":""},{"$f":"IF(AC77=\"\",\"\",IF(AC77>=1,基本!$E$20))","v":""},0,"","","","","","","",null,null,null,null,null,null,null,null,null,null,null,null,null,null,null,null,null,null,null,null,null,null,null,null,null,null,null,null,null,null,null,null,null,null,null,null,null,null,null,null,null,null,null,null,null,null,null,null,null,null,null,null,null,"","","","","","","","","","","","","","","","","","","","","","","","","","","","","","","","","","","","","","",null,null,"","","","","","","","","","","","","","","","","","","","","","","","","","","","","",null,null,null,null,null,null,null,null,null,null,null,null,null,null,null,null,null,null,null,null,null,null,null,null,null,null,null,null,null,null,null,null,null,null,null,null,null,null,null,null,null,null,null,null,null,null,null,null,null,null,null,null,null,null,null,null,null,null,null,null,null,null,null,null,null,null,null,null,null,null,null,null,null,null,null,null,null,null,null,null,null,null,null,null,null,null,null,null,null,null,null,null,null,null,null,null,null,null,null,null,null,null,null,null,null,null,null,null,null,null,null,null,null,null,null,null,null,null,null,null,null,null,null,null,null,null,null,null,null,null,null,null,null,null,null,0,0,null,null,null,null,null,null,null,null,null,null,null,null,null,null,null,null,null,null,null,null,null,null,null,null,null,null,null,null,null,null,null,null,null,null,null,null,null,null,null,null,null,null,null,null,null,null,null,null,null,null,null,null,null,null,null,null,null,null,null,null,null,null,null,null,null,null,null,null,null,null,null,null,null,null,null,null,null,null,null,null,null,null,null,null,null,null,null,null,null,null,null,null,null,null,null,null,null,null,null,null,null,null,null,null,null,null,null,null,null,null,null,null,null,null,null,null,null,null,null,null,null,null,null,null,null,null,null,null,null,null,0,0]
[69,null,null,null,null,null,null,null,null,null,null,null,null,null,null,null,null,null,null,null,null,null,null,null,null,null,"",null,null,null,null,null,null,null,null,null,null,null,null,null,null,null,null,null,null,null,null,null,null,null,null,null,null,null,null,null,null,null,null,null,null,null,null,null,null,null,null,null,null,null,null,null,null,null,null,null,null,null,null,null,null,null,null,0,"","","","","","","","","","","","","","","","","","","","","","","","","","","","","","","","","","",null,null,null,null,null,"","","","","","","","",null,null,null,null,null,"","","","","","","","","",null,null,0,{"$f":"IF(Z78<>\"新規\",\"\",IF(AI78=3,基本!$E$14,IF(OR(AI78=1,AI78=2),基本!$E$13,\"\")))","v":""},{"$f":"IF(CF78=0,\"\",IF(AI78=3,基本!$E$16*CF78,IF(OR(AI78=1,AI78=2),基本!$E$15*CF78)))","v":""},{"$f":"IF(AJ78=\"\",\"\",IF(AJ78>0,基本!$E$17*CF78))","v":""},{"$f":"IF(ER78=0,\"\",IF(AM78<=4,基本!$E$18*ER78,IF(AM78>4,基本!$E$19*ER78)))","v":""},{"$f":"IF(AC78=\"\",\"\",IF(AC78>=1,基本!$E$20))","v":""},0,"","","","","","","",null,null,null,null,null,null,null,null,null,null,null,null,null,null,null,null,null,null,null,null,null,null,null,null,null,null,null,null,null,null,null,null,null,null,null,null,null,null,null,null,null,null,null,null,null,null,null,null,null,null,null,null,null,"","","","","","","","","","","","","","","","","","","","","","","","","","","","","","","","","","","","","","",null,null,"","","","","","","","","","","","","","","","","","","","","","","","","","","","","",null,null,null,null,null,null,null,null,null,null,null,null,null,null,null,null,null,null,null,null,null,null,null,null,null,null,null,null,null,null,null,null,null,null,null,null,null,null,null,null,null,null,null,null,null,null,null,null,null,null,null,null,null,null,null,null,null,null,null,null,null,null,null,null,null,null,null,null,null,null,null,null,null,null,null,null,null,null,null,null,null,null,null,null,null,null,null,null,null,null,null,null,null,null,null,null,null,null,null,null,null,null,null,null,null,null,null,null,null,null,null,null,null,null,null,null,null,null,null,null,null,null,null,null,null,null,null,null,null,null,null,null,null,null,null,0,0,null,null,null,null,null,null,null,null,null,null,null,null,null,null,null,null,null,null,null,null,null,null,null,null,null,null,null,null,null,null,null,null,null,null,null,null,null,null,null,null,null,null,null,null,null,null,null,null,null,null,null,null,null,null,null,null,null,null,null,null,null,null,null,null,null,null,null,null,null,null,null,null,null,null,null,null,null,null,null,null,null,null,null,null,null,null,null,null,null,null,null,null,null,null,null,null,null,null,null,null,null,null,null,null,null,null,null,null,null,null,null,null,null,null,null,null,null,null,null,null,null,null,null,null,null,null,null,null,null,null,0,0]
[70,null,null,null,null,null,null,null,null,null,null,null,null,null,null,null,null,null,null,null,null,null,null,null,null,null,"",null,null,null,null,null,null,null,null,null,null,null,null,null,null,null,null,null,null,null,null,null,null,null,null,null,null,null,null,null,null,null,null,null,null,null,null,null,null,null,null,null,null,null,null,null,null,null,null,null,null,null,null,null,null,null,null,0,"","","","","","","","","","","","","","","","","","","","","","","","","","","","","","","","","","",null,null,null,null,null,"","","","","","","","",null,null,null,null,null,"","","","","","","","","",null,null,0,{"$f":"IF(Z79<>\"新規\",\"\",IF(AI79=3,基本!$E$14,IF(OR(AI79=1,AI79=2),基本!$E$13,\"\")))","v":""},{"$f":"IF(CF79=0,\"\",IF(AI79=3,基本!$E$16*CF79,IF(OR(AI79=1,AI79=2),基本!$E$15*CF79)))","v":""},{"$f":"IF(AJ79=\"\",\"\",IF(AJ79>0,基本!$E$17*CF79))","v":""},{"$f":"IF(ER79=0,\"\",IF(AM79<=4,基本!$E$18*ER79,IF(AM79>4,基本!$E$19*ER79)))","v":""},{"$f":"IF(AC79=\"\",\"\",IF(AC79>=1,基本!$E$20))","v":""},0,"","","","","","","",null,null,null,null,null,null,null,null,null,null,null,null,null,null,null,null,null,null,null,null,null,null,null,null,null,null,null,null,null,null,null,null,null,null,null,null,null,null,null,null,null,null,null,null,null,null,null,null,null,null,null,null,null,"","","","","","","","","","","","","","","","","","","","","","","","","","","","","","","","","","","","","","",null,null,"","","","","","","","","","","","","","","","","","","","","","","","","","","","","",null,null,null,null,null,null,null,null,null,null,null,null,null,null,null,null,null,null,null,null,null,null,null,null,null,null,null,null,null,null,null,null,null,null,null,null,null,null,null,null,null,null,null,null,null,null,null,null,null,null,null,null,null,null,null,null,null,null,null,null,null,null,null,null,null,null,null,null,null,null,null,null,null,null,null,null,null,null,null,null,null,null,null,null,null,null,null,null,null,null,null,null,null,null,null,null,null,null,null,null,null,null,null,null,null,null,null,null,null,null,null,null,null,null,null,null,null,null,null,null,null,null,null,null,null,null,null,null,null,null,null,null,null,null,null,0,0,null,null,null,null,null,null,null,null,null,null,null,null,null,null,null,null,null,null,null,null,null,null,null,null,null,null,null,null,null,null,null,null,null,null,null,null,null,null,null,null,null,null,null,null,null,null,null,null,null,null,null,null,null,null,null,null,null,null,null,null,null,null,null,null,null,null,null,null,null,null,null,null,null,null,null,null,null,null,null,null,null,null,null,null,null,null,null,null,null,null,null,null,null,null,null,null,null,null,null,null,null,null,null,null,null,null,null,null,null,null,null,null,null,null,null,null,null,null,null,null,null,null,null,null,null,null,null,null,null,null,0,0]
[71,null,null,null,null,null,null,null,null,null,null,null,null,null,null,null,null,null,null,null,null,null,null,null,null,null,"",null,null,null,null,null,null,null,null,null,null,null,null,null,null,null,null,null,null,null,null,null,null,null,null,null,null,null,null,null,null,null,null,null,null,null,null,null,null,null,null,null,null,null,null,null,null,null,null,null,null,null,null,null,null,null,null,0,"","","","","","","","","","","","","","","","","","","","","","","","","","","","","","","","","","",null,null,null,null,null,"","","","","","","","",null,null,null,null,null,"","","","","","","","","",null,null,0,{"$f":"IF(Z80<>\"新規\",\"\",IF(AI80=3,基本!$E$14,IF(OR(AI80=1,AI80=2),基本!$E$13,\"\")))","v":""},{"$f":"IF(CF80=0,\"\",IF(AI80=3,基本!$E$16*CF80,IF(OR(AI80=1,AI80=2),基本!$E$15*CF80)))","v":""},{"$f":"IF(AJ80=\"\",\"\",IF(AJ80>0,基本!$E$17*CF80))","v":""},{"$f":"IF(ER80=0,\"\",IF(AM80<=4,基本!$E$18*ER80,IF(AM80>4,基本!$E$19*ER80)))","v":""},{"$f":"IF(AC80=\"\",\"\",IF(AC80>=1,基本!$E$20))","v":""},0,"","","","","","","",null,null,null,null,null,null,null,null,null,null,null,null,null,null,null,null,null,null,null,null,null,null,null,null,null,null,null,null,null,null,null,null,null,null,null,null,null,null,null,null,null,null,null,null,null,null,null,null,null,null,null,null,null,"","","","","","","","","","","","","","","","","","","","","","","","","","","","","","","","","","","","","","",null,null,"","","","","","","","","","","","","","","","","","","","","","","","","","","","","",null,null,null,null,null,null,null,null,null,null,null,null,null,null,null,null,null,null,null,null,null,null,null,null,null,null,null,null,null,null,null,null,null,null,null,null,null,null,null,null,null,null,null,null,null,null,null,null,null,null,null,null,null,null,null,null,null,null,null,null,null,null,null,null,null,null,null,null,null,null,null,null,null,null,null,null,null,null,null,null,null,null,null,null,null,null,null,null,null,null,null,null,null,null,null,null,null,null,null,null,null,null,null,null,null,null,null,null,null,null,null,null,null,null,null,null,null,null,null,null,null,null,null,null,null,null,null,null,null,null,null,null,null,null,null,0,0,null,null,null,null,null,null,null,null,null,null,null,null,null,null,null,null,null,null,null,null,null,null,null,null,null,null,null,null,null,null,null,null,null,null,null,null,null,null,null,null,null,null,null,null,null,null,null,null,null,null,null,null,null,null,null,null,null,null,null,null,null,null,null,null,null,null,null,null,null,null,null,null,null,null,null,null,null,null,null,null,null,null,null,null,null,null,null,null,null,null,null,null,null,null,null,null,null,null,null,null,null,null,null,null,null,null,null,null,null,null,null,null,null,null,null,null,null,null,null,null,null,null,null,null,null,null,null,null,null,null,0,0]
[72,null,null,null,null,null,null,null,null,null,null,null,null,null,null,null,null,null,null,null,null,null,null,null,null,null,"",null,null,null,null,null,null,null,null,null,null,null,null,null,null,null,null,null,null,null,null,null,null,null,null,null,null,null,null,null,null,null,null,null,null,null,null,null,null,null,null,null,null,null,null,null,null,null,null,null,null,null,null,null,null,null,null,0,"","","","","","","","","","","","","","","","","","","","","","","","","","","","","","","","","","",null,null,null,null,null,"","","","","","","","",null,null,null,null,null,"","","","","","","","","",null,null,0,{"$f":"IF(Z81<>\"新規\",\"\",IF(AI81=3,基本!$E$14,IF(OR(AI81=1,AI81=2),基本!$E$13,\"\")))","v":""},{"$f":"IF(CF81=0,\"\",IF(AI81=3,基本!$E$16*CF81,IF(OR(AI81=1,AI81=2),基本!$E$15*CF81)))","v":""},{"$f":"IF(AJ81=\"\",\"\",IF(AJ81>0,基本!$E$17*CF81))","v":""},{"$f":"IF(ER81=0,\"\",IF(AM81<=4,基本!$E$18*ER81,IF(AM81>4,基本!$E$19*ER81)))","v":""},{"$f":"IF(AC81=\"\",\"\",IF(AC81>=1,基本!$E$20))","v":""},0,"","","","","","","",null,null,null,null,null,null,null,null,null,null,null,null,null,null,null,null,null,null,null,null,null,null,null,null,null,null,null,null,null,null,null,null,null,null,null,null,null,null,null,null,null,null,null,null,null,null,null,null,null,null,null,null,null,"","","","","","","","","","","","","","","","","","","","","","","","","","","","","","","","","","","","","","",null,null,"","","","","","","","","","","","","","","","","","","","","","","","","","","","","",null,null,null,null,null,null,null,null,null,null,null,null,null,null,null,null,null,null,null,null,null,null,null,null,null,null,null,null,null,null,null,null,null,null,null,null,null,null,null,null,null,null,null,null,null,null,null,null,null,null,null,null,null,null,null,null,null,null,null,null,null,null,null,null,null,null,null,null,null,null,null,null,null,null,null,null,null,null,null,null,null,null,null,null,null,null,null,null,null,null,null,null,null,null,null,null,null,null,null,null,null,null,null,null,null,null,null,null,null,null,null,null,null,null,null,null,null,null,null,null,null,null,null,null,null,null,null,null,null,null,null,null,null,null,null,0,0,null,null,null,null,null,null,null,null,null,null,null,null,null,null,null,null,null,null,null,null,null,null,null,null,null,null,null,null,null,null,null,null,null,null,null,null,null,null,null,null,null,null,null,null,null,null,null,null,null,null,null,null,null,null,null,null,null,null,null,null,null,null,null,null,null,null,null,null,null,null,null,null,null,null,null,null,null,null,null,null,null,null,null,null,null,null,null,null,null,null,null,null,null,null,null,null,null,null,null,null,null,null,null,null,null,null,null,null,null,null,null,null,null,null,null,null,null,null,null,null,null,null,null,null,null,null,null,null,null,null,0,0]
[73,null,null,null,null,null,null,null,null,null,null,null,null,null,null,null,null,null,null,null,null,null,null,null,null,null,"",null,null,null,null,null,null,null,null,null,null,null,null,null,null,null,null,null,null,null,null,null,null,null,null,null,null,null,null,null,null,null,null,null,null,null,null,null,null,null,null,null,null,null,null,null,null,null,null,null,null,null,null,null,null,null,null,0,"","","","","","","","","","","","","","","","","","","","","","","","","","","","","","","","","","",null,null,null,null,null,"","","","","","","","",null,null,null,null,null,"","","","","","","","","",null,null,0,{"$f":"IF(Z82<>\"新規\",\"\",IF(AI82=3,基本!$E$14,IF(OR(AI82=1,AI82=2),基本!$E$13,\"\")))","v":""},{"$f":"IF(CF82=0,\"\",IF(AI82=3,基本!$E$16*CF82,IF(OR(AI82=1,AI82=2),基本!$E$15*CF82)))","v":""},{"$f":"IF(AJ82=\"\",\"\",IF(AJ82>0,基本!$E$17*CF82))","v":""},{"$f":"IF(ER82=0,\"\",IF(AM82<=4,基本!$E$18*ER82,IF(AM82>4,基本!$E$19*ER82)))","v":""},{"$f":"IF(AC82=\"\",\"\",IF(AC82>=1,基本!$E$20))","v":""},0,"","","","","","","",null,null,null,null,null,null,null,null,null,null,null,null,null,null,null,null,null,null,null,null,null,null,null,null,null,null,null,null,null,null,null,null,null,null,null,null,null,null,null,null,null,null,null,null,null,null,null,null,null,null,null,null,null,"","","","","","","","","","","","","","","","","","","","","","","","","","","","","","","","","","","","","","",null,null,"","","","","","","","","","","","","","","","","","","","","","","","","","","","","",null,null,null,null,null,null,null,null,null,null,null,null,null,null,null,null,null,null,null,null,null,null,null,null,null,null,null,null,null,null,null,null,null,null,null,null,null,null,null,null,null,null,null,null,null,null,null,null,null,null,null,null,null,null,null,null,null,null,null,null,null,null,null,null,null,null,null,null,null,null,null,null,null,null,null,null,null,null,null,null,null,null,null,null,null,null,null,null,null,null,null,null,null,null,null,null,null,null,null,null,null,null,null,null,null,null,null,null,null,null,null,null,null,null,null,null,null,null,null,null,null,null,null,null,null,null,null,null,null,null,null,null,null,null,null,0,0,null,null,null,null,null,null,null,null,null,null,null,null,null,null,null,null,null,null,null,null,null,null,null,null,null,null,null,null,null,null,null,null,null,null,null,null,null,null,null,null,null,null,null,null,null,null,null,null,null,null,null,null,null,null,null,null,null,null,null,null,null,null,null,null,null,null,null,null,null,null,null,null,null,null,null,null,null,null,null,null,null,null,null,null,null,null,null,null,null,null,null,null,null,null,null,null,null,null,null,null,null,null,null,null,null,null,null,null,null,null,null,null,null,null,null,null,null,null,null,null,null,null,null,null,null,null,null,null,null,null,0,0]
[74,null,null,null,null,null,null,null,null,null,null,null,null,null,null,null,null,null,null,null,null,null,null,null,null,null,"",null,null,null,null,null,null,null,null,null,null,null,null,null,null,null,null,null,null,null,null,null,null,null,null,null,null,null,null,null,null,null,null,null,null,null,null,null,null,null,null,null,null,null,null,null,null,null,null,null,null,null,null,null,null,null,null,0,"","","","","","","","","","","","","","","","","","","","","","","","","","","","","","","","","","",null,null,null,null,null,"","","","","","","","",null,null,null,null,null,"","","","","","","","","",null,null,0,{"$f":"IF(Z83<>\"新規\",\"\",IF(AI83=3,基本!$E$14,IF(OR(AI83=1,AI83=2),基本!$E$13,\"\")))","v":""},{"$f":"IF(CF83=0,\"\",IF(AI83=3,基本!$E$16*CF83,IF(OR(AI83=1,AI83=2),基本!$E$15*CF83)))","v":""},{"$f":"IF(AJ83=\"\",\"\",IF(AJ83>0,基本!$E$17*CF83))","v":""},{"$f":"IF(ER83=0,\"\",IF(AM83<=4,基本!$E$18*ER83,IF(AM83>4,基本!$E$19*ER83)))","v":""},{"$f":"IF(AC83=\"\",\"\",IF(AC83>=1,基本!$E$20))","v":""},0,"","","","","","","",null,null,null,null,null,null,null,null,null,null,null,null,null,null,null,null,null,null,null,null,null,null,null,null,null,null,null,null,null,null,null,null,null,null,null,null,null,null,null,null,null,null,null,null,null,null,null,null,null,null,null,null,null,"","","","","","","","","","","","","","","","","","","","","","","","","","","","","","","","","","","","","","",null,null,"","","","","","","","","","","","","","","","","","","","","","","","","","","","","",null,null,null,null,null,null,null,null,null,null,null,null,null,null,null,null,null,null,null,null,null,null,null,null,null,null,null,null,null,null,null,null,null,null,null,null,null,null,null,null,null,null,null,null,null,null,null,null,null,null,null,null,null,null,null,null,null,null,null,null,null,null,null,null,null,null,null,null,null,null,null,null,null,null,null,null,null,null,null,null,null,null,null,null,null,null,null,null,null,null,null,null,null,null,null,null,null,null,null,null,null,null,null,null,null,null,null,null,null,null,null,null,null,null,null,null,null,null,null,null,null,null,null,null,null,null,null,null,null,null,null,null,null,null,null,0,0,null,null,null,null,null,null,null,null,null,null,null,null,null,null,null,null,null,null,null,null,null,null,null,null,null,null,null,null,null,null,null,null,null,null,null,null,null,null,null,null,null,null,null,null,null,null,null,null,null,null,null,null,null,null,null,null,null,null,null,null,null,null,null,null,null,null,null,null,null,null,null,null,null,null,null,null,null,null,null,null,null,null,null,null,null,null,null,null,null,null,null,null,null,null,null,null,null,null,null,null,null,null,null,null,null,null,null,null,null,null,null,null,null,null,null,null,null,null,null,null,null,null,null,null,null,null,null,null,null,null,0,0]
[75,null,null,null,null,null,null,null,null,null,null,null,null,null,null,null,null,null,null,null,null,null,null,null,null,null,"",null,null,null,null,null,null,null,null,null,null,null,null,null,null,null,null,null,null,null,null,null,null,null,null,null,null,null,null,null,null,null,null,null,null,null,null,null,null,null,null,null,null,null,null,null,null,null,null,null,null,null,null,null,null,null,null,0,"","","","","","","","","","","","","","","","","","","","","","","","","","","","","","","","","","",null,null,null,null,null,"","","","","","","","",null,null,null,null,null,"","","","","","","","","",null,null,0,{"$f":"IF(Z84<>\"新規\",\"\",IF(AI84=3,基本!$E$14,IF(OR(AI84=1,AI84=2),基本!$E$13,\"\")))","v":""},{"$f":"IF(CF84=0,\"\",IF(AI84=3,基本!$E$16*CF84,IF(OR(AI84=1,AI84=2),基本!$E$15*CF84)))","v":""},{"$f":"IF(AJ84=\"\",\"\",IF(AJ84>0,基本!$E$17*CF84))","v":""},{"$f":"IF(ER84=0,\"\",IF(AM84<=4,基本!$E$18*ER84,IF(AM84>4,基本!$E$19*ER84)))","v":""},{"$f":"IF(AC84=\"\",\"\",IF(AC84>=1,基本!$E$20))","v":""},0,"","","","","","","",null,null,null,null,null,null,null,null,null,null,null,null,null,null,null,null,null,null,null,null,null,null,null,null,null,null,null,null,null,null,null,null,null,null,null,null,null,null,null,null,null,null,null,null,null,null,null,null,null,null,null,null,null,"","","","","","","","","","","","","","","","","","","","","","","","","","","","","","","","","","","","","","",null,null,"","","","","","","","","","","","","","","","","","","","","","","","","","","","","",null,null,null,null,null,null,null,null,null,null,null,null,null,null,null,null,null,null,null,null,null,null,null,null,null,null,null,null,null,null,null,null,null,null,null,null,null,null,null,null,null,null,null,null,null,null,null,null,null,null,null,null,null,null,null,null,null,null,null,null,null,null,null,null,null,null,null,null,null,null,null,null,null,null,null,null,null,null,null,null,null,null,null,null,null,null,null,null,null,null,null,null,null,null,null,null,null,null,null,null,null,null,null,null,null,null,null,null,null,null,null,null,null,null,null,null,null,null,null,null,null,null,null,null,null,null,null,null,null,null,null,null,null,null,null,0,0,null,null,null,null,null,null,null,null,null,null,null,null,null,null,null,null,null,null,null,null,null,null,null,null,null,null,null,null,null,null,null,null,null,null,null,null,null,null,null,null,null,null,null,null,null,null,null,null,null,null,null,null,null,null,null,null,null,null,null,null,null,null,null,null,null,null,null,null,null,null,null,null,null,null,null,null,null,null,null,null,null,null,null,null,null,null,null,null,null,null,null,null,null,null,null,null,null,null,null,null,null,null,null,null,null,null,null,null,null,null,null,null,null,null,null,null,null,null,null,null,null,null,null,null,null,null,null,null,null,null,0,0]
[76,null,null,null,null,null,null,null,null,null,null,null,null,null,null,null,null,null,null,null,null,null,null,null,null,null,"",null,null,null,null,null,null,null,null,null,null,null,null,null,null,null,null,null,null,null,null,null,null,null,null,null,null,null,null,null,null,null,null,null,null,null,null,null,null,null,null,null,null,null,null,null,null,null,null,null,null,null,null,null,null,null,null,0,"","","","","","","","","","","","","","","","","","","","","","","","","","","","","","","","","","",null,null,null,null,null,"","","","","","","","",null,null,null,null,null,"","","","","","","","","",null,null,0,{"$f":"IF(Z85<>\"新規\",\"\",IF(AI85=3,基本!$E$14,IF(OR(AI85=1,AI85=2),基本!$E$13,\"\")))","v":""},{"$f":"IF(CF85=0,\"\",IF(AI85=3,基本!$E$16*CF85,IF(OR(AI85=1,AI85=2),基本!$E$15*CF85)))","v":""},{"$f":"IF(AJ85=\"\",\"\",IF(AJ85>0,基本!$E$17*CF85))","v":""},{"$f":"IF(ER85=0,\"\",IF(AM85<=4,基本!$E$18*ER85,IF(AM85>4,基本!$E$19*ER85)))","v":""},{"$f":"IF(AC85=\"\",\"\",IF(AC85>=1,基本!$E$20))","v":""},0,"","","","","","","",null,null,null,null,null,null,null,null,null,null,null,null,null,null,null,null,null,null,null,null,null,null,null,null,null,null,null,null,null,null,null,null,null,null,null,null,null,null,null,null,null,null,null,null,null,null,null,null,null,null,null,null,null,"","","","","","","","","","","","","","","","","","","","","","","","","","","","","","","","","","","","","","",null,null,"","","","","","","","","","","","","","","","","","","","","","","","","","","","","",null,null,null,null,null,null,null,null,null,null,null,null,null,null,null,null,null,null,null,null,null,null,null,null,null,null,null,null,null,null,null,null,null,null,null,null,null,null,null,null,null,null,null,null,null,null,null,null,null,null,null,null,null,null,null,null,null,null,null,null,null,null,null,null,null,null,null,null,null,null,null,null,null,null,null,null,null,null,null,null,null,null,null,null,null,null,null,null,null,null,null,null,null,null,null,null,null,null,null,null,null,null,null,null,null,null,null,null,null,null,null,null,null,null,null,null,null,null,null,null,null,null,null,null,null,null,null,null,null,null,null,null,null,null,null,0,0,null,null,null,null,null,null,null,null,null,null,null,null,null,null,null,null,null,null,null,null,null,null,null,null,null,null,null,null,null,null,null,null,null,null,null,null,null,null,null,null,null,null,null,null,null,null,null,null,null,null,null,null,null,null,null,null,null,null,null,null,null,null,null,null,null,null,null,null,null,null,null,null,null,null,null,null,null,null,null,null,null,null,null,null,null,null,null,null,null,null,null,null,null,null,null,null,null,null,null,null,null,null,null,null,null,null,null,null,null,null,null,null,null,null,null,null,null,null,null,null,null,null,null,null,null,null,null,null,null,null,0,0]
[77,null,null,null,null,null,null,null,null,null,null,null,null,null,null,null,null,null,null,null,null,null,null,null,null,null,"",null,null,null,null,null,null,null,null,null,null,null,null,null,null,null,null,null,null,null,null,null,null,null,null,null,null,null,null,null,null,null,null,null,null,null,null,null,null,null,null,null,null,null,null,null,null,null,null,null,null,null,null,null,null,null,null,0,"","","","","","","","","","","","","","","","","","","","","","","","","","","","","","","","","","",null,null,null,null,null,"","","","","","","","",null,null,null,null,null,"","","","","","","","","",null,null,0,{"$f":"IF(Z86<>\"新規\",\"\",IF(AI86=3,基本!$E$14,IF(OR(AI86=1,AI86=2),基本!$E$13,\"\")))","v":""},{"$f":"IF(CF86=0,\"\",IF(AI86=3,基本!$E$16*CF86,IF(OR(AI86=1,AI86=2),基本!$E$15*CF86)))","v":""},{"$f":"IF(AJ86=\"\",\"\",IF(AJ86>0,基本!$E$17*CF86))","v":""},{"$f":"IF(ER86=0,\"\",IF(AM86<=4,基本!$E$18*ER86,IF(AM86>4,基本!$E$19*ER86)))","v":""},{"$f":"IF(AC86=\"\",\"\",IF(AC86>=1,基本!$E$20))","v":""},0,"","","","","","","",null,null,null,null,null,null,null,null,null,null,null,null,null,null,null,null,null,null,null,null,null,null,null,null,null,null,null,null,null,null,null,null,null,null,null,null,null,null,null,null,null,null,null,null,null,null,null,null,null,null,null,null,null,"","","","","","","","","","","","","","","","","","","","","","","","","","","","","","","","","","","","","","",null,null,"","","","","","","","","","","","","","","","","","","","","","","","","","","","","",null,null,null,null,null,null,null,null,null,null,null,null,null,null,null,null,null,null,null,null,null,null,null,null,null,null,null,null,null,null,null,null,null,null,null,null,null,null,null,null,null,null,null,null,null,null,null,null,null,null,null,null,null,null,null,null,null,null,null,null,null,null,null,null,null,null,null,null,null,null,null,null,null,null,null,null,null,null,null,null,null,null,null,null,null,null,null,null,null,null,null,null,null,null,null,null,null,null,null,null,null,null,null,null,null,null,null,null,null,null,null,null,null,null,null,null,null,null,null,null,null,null,null,null,null,null,null,null,null,null,null,null,null,null,null,0,0,null,null,null,null,null,null,null,null,null,null,null,null,null,null,null,null,null,null,null,null,null,null,null,null,null,null,null,null,null,null,null,null,null,null,null,null,null,null,null,null,null,null,null,null,null,null,null,null,null,null,null,null,null,null,null,null,null,null,null,null,null,null,null,null,null,null,null,null,null,null,null,null,null,null,null,null,null,null,null,null,null,null,null,null,null,null,null,null,null,null,null,null,null,null,null,null,null,null,null,null,null,null,null,null,null,null,null,null,null,null,null,null,null,null,null,null,null,null,null,null,null,null,null,null,null,null,null,null,null,null,0,0]
[78,null,null,null,null,null,null,null,null,null,null,null,null,null,null,null,null,null,null,null,null,null,null,null,null,null,"",null,null,null,null,null,null,null,null,null,null,null,null,null,null,null,null,null,null,null,null,null,null,null,null,null,null,null,null,null,null,null,null,null,null,null,null,null,null,null,null,null,null,null,null,null,null,null,null,null,null,null,null,null,null,null,null,0,"","","","","","","","","","","","","","","","","","","","","","","","","","","","","","","","","","",null,null,null,null,null,"","","","","","","","",null,null,null,null,null,"","","","","","","","","",null,null,0,{"$f":"IF(Z87<>\"新規\",\"\",IF(AI87=3,基本!$E$14,IF(OR(AI87=1,AI87=2),基本!$E$13,\"\")))","v":""},{"$f":"IF(CF87=0,\"\",IF(AI87=3,基本!$E$16*CF87,IF(OR(AI87=1,AI87=2),基本!$E$15*CF87)))","v":""},{"$f":"IF(AJ87=\"\",\"\",IF(AJ87>0,基本!$E$17*CF87))","v":""},{"$f":"IF(ER87=0,\"\",IF(AM87<=4,基本!$E$18*ER87,IF(AM87>4,基本!$E$19*ER87)))","v":""},{"$f":"IF(AC87=\"\",\"\",IF(AC87>=1,基本!$E$20))","v":""},0,"","","","","","","",null,null,null,null,null,null,null,null,null,null,null,null,null,null,null,null,null,null,null,null,null,null,null,null,null,null,null,null,null,null,null,null,null,null,null,null,null,null,null,null,null,null,null,null,null,null,null,null,null,null,null,null,null,"","","","","","","","","","","","","","","","","","","","","","","","","","","","","","","","","","","","","","",null,null,"","","","","","","","","","","","","","","","","","","","","","","","","","","","","",null,null,null,null,null,null,null,null,null,null,null,null,null,null,null,null,null,null,null,null,null,null,null,null,null,null,null,null,null,null,null,null,null,null,null,null,null,null,null,null,null,null,null,null,null,null,null,null,null,null,null,null,null,null,null,null,null,null,null,null,null,null,null,null,null,null,null,null,null,null,null,null,null,null,null,null,null,null,null,null,null,null,null,null,null,null,null,null,null,null,null,null,null,null,null,null,null,null,null,null,null,null,null,null,null,null,null,null,null,null,null,null,null,null,null,null,null,null,null,null,null,null,null,null,null,null,null,null,null,null,null,null,null,null,null,0,0,null,null,null,null,null,null,null,null,null,null,null,null,null,null,null,null,null,null,null,null,null,null,null,null,null,null,null,null,null,null,null,null,null,null,null,null,null,null,null,null,null,null,null,null,null,null,null,null,null,null,null,null,null,null,null,null,null,null,null,null,null,null,null,null,null,null,null,null,null,null,null,null,null,null,null,null,null,null,null,null,null,null,null,null,null,null,null,null,null,null,null,null,null,null,null,null,null,null,null,null,null,null,null,null,null,null,null,null,null,null,null,null,null,null,null,null,null,null,null,null,null,null,null,null,null,null,null,null,null,null,0,0]
[79,null,null,null,null,null,null,null,null,null,null,null,null,null,null,null,null,null,null,null,null,null,null,null,null,null,"",null,null,null,null,null,null,null,null,null,null,null,null,null,null,null,null,null,null,null,null,null,null,null,null,null,null,null,null,null,null,null,null,null,null,null,null,null,null,null,null,null,null,null,null,null,null,null,null,null,null,null,null,null,null,null,null,0,"","","","","","","","","","","","","","","","","","","","","","","","","","","","","","","","","","",null,null,null,null,null,"","","","","","","","",null,null,null,null,null,"","","","","","","","","",null,null,0,{"$f":"IF(Z88<>\"新規\",\"\",IF(AI88=3,基本!$E$14,IF(OR(AI88=1,AI88=2),基本!$E$13,\"\")))","v":""},{"$f":"IF(CF88=0,\"\",IF(AI88=3,基本!$E$16*CF88,IF(OR(AI88=1,AI88=2),基本!$E$15*CF88)))","v":""},{"$f":"IF(AJ88=\"\",\"\",IF(AJ88>0,基本!$E$17*CF88))","v":""},{"$f":"IF(ER88=0,\"\",IF(AM88<=4,基本!$E$18*ER88,IF(AM88>4,基本!$E$19*ER88)))","v":""},{"$f":"IF(AC88=\"\",\"\",IF(AC88>=1,基本!$E$20))","v":""},0,"","","","","","","",null,null,null,null,null,null,null,null,null,null,null,null,null,null,null,null,null,null,null,null,null,null,null,null,null,null,null,null,null,null,null,null,null,null,null,null,null,null,null,null,null,null,null,null,null,null,null,null,null,null,null,null,null,"","","","","","","","","","","","","","","","","","","","","","","","","","","","","","","","","","","","","","",null,null,"","","","","","","","","","","","","","","","","","","","","","","","","","","","","",null,null,null,null,null,null,null,null,null,null,null,null,null,null,null,null,null,null,null,null,null,null,null,null,null,null,null,null,null,null,null,null,null,null,null,null,null,null,null,null,null,null,null,null,null,null,null,null,null,null,null,null,null,null,null,null,null,null,null,null,null,null,null,null,null,null,null,null,null,null,null,null,null,null,null,null,null,null,null,null,null,null,null,null,null,null,null,null,null,null,null,null,null,null,null,null,null,null,null,null,null,null,null,null,null,null,null,null,null,null,null,null,null,null,null,null,null,null,null,null,null,null,null,null,null,null,null,null,null,null,null,null,null,null,null,0,0,null,null,null,null,null,null,null,null,null,null,null,null,null,null,null,null,null,null,null,null,null,null,null,null,null,null,null,null,null,null,null,null,null,null,null,null,null,null,null,null,null,null,null,null,null,null,null,null,null,null,null,null,null,null,null,null,null,null,null,null,null,null,null,null,null,null,null,null,null,null,null,null,null,null,null,null,null,null,null,null,null,null,null,null,null,null,null,null,null,null,null,null,null,null,null,null,null,null,null,null,null,null,null,null,null,null,null,null,null,null,null,null,null,null,null,null,null,null,null,null,null,null,null,null,null,null,null,null,null,null,0,0]
[80,null,null,null,null,null,null,null,null,null,null,null,null,null,null,null,null,null,null,null,null,null,null,null,null,null,"",null,null,null,null,null,null,null,null,null,null,null,null,null,null,null,null,null,null,null,null,null,null,null,null,null,null,null,null,null,null,null,null,null,null,null,null,null,null,null,null,null,null,null,null,null,null,null,null,null,null,null,null,null,null,null,null,0,"","","","","","","","","","","","","","","","","","","","","","","","","","","","","","","","","","",null,null,null,null,null,"","","","","","","","",null,null,null,null,null,"","","","","","","","","",null,null,0,{"$f":"IF(Z89<>\"新規\",\"\",IF(AI89=3,基本!$E$14,IF(OR(AI89=1,AI89=2),基本!$E$13,\"\")))","v":""},{"$f":"IF(CF89=0,\"\",IF(AI89=3,基本!$E$16*CF89,IF(OR(AI89=1,AI89=2),基本!$E$15*CF89)))","v":""},{"$f":"IF(AJ89=\"\",\"\",IF(AJ89>0,基本!$E$17*CF89))","v":""},{"$f":"IF(ER89=0,\"\",IF(AM89<=4,基本!$E$18*ER89,IF(AM89>4,基本!$E$19*ER89)))","v":""},{"$f":"IF(AC89=\"\",\"\",IF(AC89>=1,基本!$E$20))","v":""},0,"","","","","","","",null,null,null,null,null,null,null,null,null,null,null,null,null,null,null,null,null,null,null,null,null,null,null,null,null,null,null,null,null,null,null,null,null,null,null,null,null,null,null,null,null,null,null,null,null,null,null,null,null,null,null,null,null,"","","","","","","","","","","","","","","","","","","","","","","","","","","","","","","","","","","","","","",null,null,"","","","","","","","","","","","","","","","","","","","","","","","","","","","","",null,null,null,null,null,null,null,null,null,null,null,null,null,null,null,null,null,null,null,null,null,null,null,null,null,null,null,null,null,null,null,null,null,null,null,null,null,null,null,null,null,null,null,null,null,null,null,null,null,null,null,null,null,null,null,null,null,null,null,null,null,null,null,null,null,null,null,null,null,null,null,null,null,null,null,null,null,null,null,null,null,null,null,null,null,null,null,null,null,null,null,null,null,null,null,null,null,null,null,null,null,null,null,null,null,null,null,null,null,null,null,null,null,null,null,null,null,null,null,null,null,null,null,null,null,null,null,null,null,null,null,null,null,null,null,0,0,null,null,null,null,null,null,null,null,null,null,null,null,null,null,null,null,null,null,null,null,null,null,null,null,null,null,null,null,null,null,null,null,null,null,null,null,null,null,null,null,null,null,null,null,null,null,null,null,null,null,null,null,null,null,null,null,null,null,null,null,null,null,null,null,null,null,null,null,null,null,null,null,null,null,null,null,null,null,null,null,null,null,null,null,null,null,null,null,null,null,null,null,null,null,null,null,null,null,null,null,null,null,null,null,null,null,null,null,null,null,null,null,null,null,null,null,null,null,null,null,null,null,null,null,null,null,null,null,null,null,0,0]
[81,null,null,null,null,null,null,null,null,null,null,null,null,null,null,null,null,null,null,null,null,null,null,null,null,null,"",null,null,null,null,null,null,null,null,null,null,null,null,null,null,null,null,null,null,null,null,null,null,null,null,null,null,null,null,null,null,null,null,null,null,null,null,null,null,null,null,null,null,null,null,null,null,null,null,null,null,null,null,null,null,null,null,0,"","","","","","","","","","","","","","","","","","","","","","","","","","","","","","","","","","",null,null,null,null,null,"","","","","","","","",null,null,null,null,null,"","","","","","","","","",null,null,0,{"$f":"IF(Z90<>\"新規\",\"\",IF(AI90=3,基本!$E$14,IF(OR(AI90=1,AI90=2),基本!$E$13,\"\")))","v":""},{"$f":"IF(CF90=0,\"\",IF(AI90=3,基本!$E$16*CF90,IF(OR(AI90=1,AI90=2),基本!$E$15*CF90)))","v":""},{"$f":"IF(AJ90=\"\",\"\",IF(AJ90>0,基本!$E$17*CF90))","v":""},{"$f":"IF(ER90=0,\"\",IF(AM90<=4,基本!$E$18*ER90,IF(AM90>4,基本!$E$19*ER90)))","v":""},{"$f":"IF(AC90=\"\",\"\",IF(AC90>=1,基本!$E$20))","v":""},0,"","","","","","","",null,null,null,null,null,null,null,null,null,null,null,null,null,null,null,null,null,null,null,null,null,null,null,null,null,null,null,null,null,null,null,null,null,null,null,null,null,null,null,null,null,null,null,null,null,null,null,null,null,null,null,null,null,"","","","","","","","","","","","","","","","","","","","","","","","","","","","","","","","","","","","","","",null,null,"","","","","","","","","","","","","","","","","","","","","","","","","","","","","",null,null,null,null,null,null,null,null,null,null,null,null,null,null,null,null,null,null,null,null,null,null,null,null,null,null,null,null,null,null,null,null,null,null,null,null,null,null,null,null,null,null,null,null,null,null,null,null,null,null,null,null,null,null,null,null,null,null,null,null,null,null,null,null,null,null,null,null,null,null,null,null,null,null,null,null,null,null,null,null,null,null,null,null,null,null,null,null,null,null,null,null,null,null,null,null,null,null,null,null,null,null,null,null,null,null,null,null,null,null,null,null,null,null,null,null,null,null,null,null,null,null,null,null,null,null,null,null,null,null,null,null,null,null,null,0,0,null,null,null,null,null,null,null,null,null,null,null,null,null,null,null,null,null,null,null,null,null,null,null,null,null,null,null,null,null,null,null,null,null,null,null,null,null,null,null,null,null,null,null,null,null,null,null,null,null,null,null,null,null,null,null,null,null,null,null,null,null,null,null,null,null,null,null,null,null,null,null,null,null,null,null,null,null,null,null,null,null,null,null,null,null,null,null,null,null,null,null,null,null,null,null,null,null,null,null,null,null,null,null,null,null,null,null,null,null,null,null,null,null,null,null,null,null,null,null,null,null,null,null,null,null,null,null,null,null,null,0,0]
[82,null,null,null,null,null,null,null,null,null,null,null,null,null,null,null,null,null,null,null,null,null,null,null,null,null,"",null,null,null,null,null,null,null,null,null,null,null,null,null,null,null,null,null,null,null,null,null,null,null,null,null,null,null,null,null,null,null,null,null,null,null,null,null,null,null,null,null,null,null,null,null,null,null,null,null,null,null,null,null,null,null,null,0,"","","","","","","","","","","","","","","","","","","","","","","","","","","","","","","","","","",null,null,null,null,null,"","","","","","","","",null,null,null,null,null,"","","","","","","","","",null,null,0,{"$f":"IF(Z91<>\"新規\",\"\",IF(AI91=3,基本!$E$14,IF(OR(AI91=1,AI91=2),基本!$E$13,\"\")))","v":""},{"$f":"IF(CF91=0,\"\",IF(AI91=3,基本!$E$16*CF91,IF(OR(AI91=1,AI91=2),基本!$E$15*CF91)))","v":""},{"$f":"IF(AJ91=\"\",\"\",IF(AJ91>0,基本!$E$17*CF91))","v":""},{"$f":"IF(ER91=0,\"\",IF(AM91<=4,基本!$E$18*ER91,IF(AM91>4,基本!$E$19*ER91)))","v":""},{"$f":"IF(AC91=\"\",\"\",IF(AC91>=1,基本!$E$20))","v":""},0,"","","","","","","",null,null,null,null,null,null,null,null,null,null,null,null,null,null,null,null,null,null,null,null,null,null,null,null,null,null,null,null,null,null,null,null,null,null,null,null,null,null,null,null,null,null,null,null,null,null,null,null,null,null,null,null,null,"","","","","","","","","","","","","","","","","","","","","","","","","","","","","","","","","","","","","","",null,null,"","","","","","","","","","","","","","","","","","","","","","","","","","","","","",null,null,null,null,null,null,null,null,null,null,null,null,null,null,null,null,null,null,null,null,null,null,null,null,null,null,null,null,null,null,null,null,null,null,null,null,null,null,null,null,null,null,null,null,null,null,null,null,null,null,null,null,null,null,null,null,null,null,null,null,null,null,null,null,null,null,null,null,null,null,null,null,null,null,null,null,null,null,null,null,null,null,null,null,null,null,null,null,null,null,null,null,null,null,null,null,null,null,null,null,null,null,null,null,null,null,null,null,null,null,null,null,null,null,null,null,null,null,null,null,null,null,null,null,null,null,null,null,null,null,null,null,null,null,null,0,0,null,null,null,null,null,null,null,null,null,null,null,null,null,null,null,null,null,null,null,null,null,null,null,null,null,null,null,null,null,null,null,null,null,null,null,null,null,null,null,null,null,null,null,null,null,null,null,null,null,null,null,null,null,null,null,null,null,null,null,null,null,null,null,null,null,null,null,null,null,null,null,null,null,null,null,null,null,null,null,null,null,null,null,null,null,null,null,null,null,null,null,null,null,null,null,null,null,null,null,null,null,null,null,null,null,null,null,null,null,null,null,null,null,null,null,null,null,null,null,null,null,null,null,null,null,null,null,null,null,null,0,0]
[83,null,null,null,null,null,null,null,null,null,null,null,null,null,null,null,null,null,null,null,null,null,null,null,null,null,"",null,null,null,null,null,null,null,null,null,null,null,null,null,null,null,null,null,null,null,null,null,null,null,null,null,null,null,null,null,null,null,null,null,null,null,null,null,null,null,null,null,null,null,null,null,null,null,null,null,null,null,null,null,null,null,null,0,"","","","","","","","","","","","","","","","","","","","","","","","","","","","","","","","","","",null,null,null,null,null,"","","","","","","","",null,null,null,null,null,"","","","","","","","","",null,null,0,{"$f":"IF(Z92<>\"新規\",\"\",IF(AI92=3,基本!$E$14,IF(OR(AI92=1,AI92=2),基本!$E$13,\"\")))","v":""},{"$f":"IF(CF92=0,\"\",IF(AI92=3,基本!$E$16*CF92,IF(OR(AI92=1,AI92=2),基本!$E$15*CF92)))","v":""},{"$f":"IF(AJ92=\"\",\"\",IF(AJ92>0,基本!$E$17*CF92))","v":""},{"$f":"IF(ER92=0,\"\",IF(AM92<=4,基本!$E$18*ER92,IF(AM92>4,基本!$E$19*ER92)))","v":""},{"$f":"IF(AC92=\"\",\"\",IF(AC92>=1,基本!$E$20))","v":""},0,"","","","","","","",null,null,null,null,null,null,null,null,null,null,null,null,null,null,null,null,null,null,null,null,null,null,null,null,null,null,null,null,null,null,null,null,null,null,null,null,null,null,null,null,null,null,null,null,null,null,null,null,null,null,null,null,null,"","","","","","","","","","","","","","","","","","","","","","","","","","","","","","","","","","","","","","",null,null,"","","","","","","","","","","","","","","","","","","","","","","","","","","","","",null,null,null,null,null,null,null,null,null,null,null,null,null,null,null,null,null,null,null,null,null,null,null,null,null,null,null,null,null,null,null,null,null,null,null,null,null,null,null,null,null,null,null,null,null,null,null,null,null,null,null,null,null,null,null,null,null,null,null,null,null,null,null,null,null,null,null,null,null,null,null,null,null,null,null,null,null,null,null,null,null,null,null,null,null,null,null,null,null,null,null,null,null,null,null,null,null,null,null,null,null,null,null,null,null,null,null,null,null,null,null,null,null,null,null,null,null,null,null,null,null,null,null,null,null,null,null,null,null,null,null,null,null,null,null,0,0,null,null,null,null,null,null,null,null,null,null,null,null,null,null,null,null,null,null,null,null,null,null,null,null,null,null,null,null,null,null,null,null,null,null,null,null,null,null,null,null,null,null,null,null,null,null,null,null,null,null,null,null,null,null,null,null,null,null,null,null,null,null,null,null,null,null,null,null,null,null,null,null,null,null,null,null,null,null,null,null,null,null,null,null,null,null,null,null,null,null,null,null,null,null,null,null,null,null,null,null,null,null,null,null,null,null,null,null,null,null,null,null,null,null,null,null,null,null,null,null,null,null,null,null,null,null,null,null,null,null,0,0]
[84,null,null,null,null,null,null,null,null,null,null,null,null,null,null,null,null,null,null,null,null,null,null,null,null,null,"",null,null,null,null,null,null,null,null,null,null,null,null,null,null,null,null,null,null,null,null,null,null,null,null,null,null,null,null,null,null,null,null,null,null,null,null,null,null,null,null,null,null,null,null,null,null,null,null,null,null,null,null,null,null,null,null,0,"","","","","","","","","","","","","","","","","","","","","","","","","","","","","","","","","","",null,null,null,null,null,"","","","","","","","",null,null,null,null,null,"","","","","","","","","",null,null,0,{"$f":"IF(Z93<>\"新規\",\"\",IF(AI93=3,基本!$E$14,IF(OR(AI93=1,AI93=2),基本!$E$13,\"\")))","v":""},{"$f":"IF(CF93=0,\"\",IF(AI93=3,基本!$E$16*CF93,IF(OR(AI93=1,AI93=2),基本!$E$15*CF93)))","v":""},{"$f":"IF(AJ93=\"\",\"\",IF(AJ93>0,基本!$E$17*CF93))","v":""},{"$f":"IF(ER93=0,\"\",IF(AM93<=4,基本!$E$18*ER93,IF(AM93>4,基本!$E$19*ER93)))","v":""},{"$f":"IF(AC93=\"\",\"\",IF(AC93>=1,基本!$E$20))","v":""},0,"","","","","","","",null,null,null,null,null,null,null,null,null,null,null,null,null,null,null,null,null,null,null,null,null,null,null,null,null,null,null,null,null,null,null,null,null,null,null,null,null,null,null,null,null,null,null,null,null,null,null,null,null,null,null,null,null,"","","","","","","","","","","","","","","","","","","","","","","","","","","","","","","","","","","","","","",null,null,"","","","","","","","","","","","","","","","","","","","","","","","","","","","","",null,null,null,null,null,null,null,null,null,null,null,null,null,null,null,null,null,null,null,null,null,null,null,null,null,null,null,null,null,null,null,null,null,null,null,null,null,null,null,null,null,null,null,null,null,null,null,null,null,null,null,null,null,null,null,null,null,null,null,null,null,null,null,null,null,null,null,null,null,null,null,null,null,null,null,null,null,null,null,null,null,null,null,null,null,null,null,null,null,null,null,null,null,null,null,null,null,null,null,null,null,null,null,null,null,null,null,null,null,null,null,null,null,null,null,null,null,null,null,null,null,null,null,null,null,null,null,null,null,null,null,null,null,null,null,0,0,null,null,null,null,null,null,null,null,null,null,null,null,null,null,null,null,null,null,null,null,null,null,null,null,null,null,null,null,null,null,null,null,null,null,null,null,null,null,null,null,null,null,null,null,null,null,null,null,null,null,null,null,null,null,null,null,null,null,null,null,null,null,null,null,null,null,null,null,null,null,null,null,null,null,null,null,null,null,null,null,null,null,null,null,null,null,null,null,null,null,null,null,null,null,null,null,null,null,null,null,null,null,null,null,null,null,null,null,null,null,null,null,null,null,null,null,null,null,null,null,null,null,null,null,null,null,null,null,null,null,0,0]
[85,null,null,null,null,null,null,null,null,null,null,null,null,null,null,null,null,null,null,null,null,null,null,null,null,null,"",null,null,null,null,null,null,null,null,null,null,null,null,null,null,null,null,null,null,null,null,null,null,null,null,null,null,null,null,null,null,null,null,null,null,null,null,null,null,null,null,null,null,null,null,null,null,null,null,null,null,null,null,null,null,null,null,0,"","","","","","","","","","","","","","","","","","","","","","","","","","","","","","","","","","",null,null,null,null,null,"","","","","","","","",null,null,null,null,null,"","","","","","","","","",null,null,0,{"$f":"IF(Z94<>\"新規\",\"\",IF(AI94=3,基本!$E$14,IF(OR(AI94=1,AI94=2),基本!$E$13,\"\")))","v":""},{"$f":"IF(CF94=0,\"\",IF(AI94=3,基本!$E$16*CF94,IF(OR(AI94=1,AI94=2),基本!$E$15*CF94)))","v":""},{"$f":"IF(AJ94=\"\",\"\",IF(AJ94>0,基本!$E$17*CF94))","v":""},{"$f":"IF(ER94=0,\"\",IF(AM94<=4,基本!$E$18*ER94,IF(AM94>4,基本!$E$19*ER94)))","v":""},{"$f":"IF(AC94=\"\",\"\",IF(AC94>=1,基本!$E$20))","v":""},0,"","","","","","","",null,null,null,null,null,null,null,null,null,null,null,null,null,null,null,null,null,null,null,null,null,null,null,null,null,null,null,null,null,null,null,null,null,null,null,null,null,null,null,null,null,null,null,null,null,null,null,null,null,null,null,null,null,"","","","","","","","","","","","","","","","","","","","","","","","","","","","","","","","","","","","","","",null,null,"","","","","","","","","","","","","","","","","","","","","","","","","","","","","",null,null,null,null,null,null,null,null,null,null,null,null,null,null,null,null,null,null,null,null,null,null,null,null,null,null,null,null,null,null,null,null,null,null,null,null,null,null,null,null,null,null,null,null,null,null,null,null,null,null,null,null,null,null,null,null,null,null,null,null,null,null,null,null,null,null,null,null,null,null,null,null,null,null,null,null,null,null,null,null,null,null,null,null,null,null,null,null,null,null,null,null,null,null,null,null,null,null,null,null,null,null,null,null,null,null,null,null,null,null,null,null,null,null,null,null,null,null,null,null,null,null,null,null,null,null,null,null,null,null,null,null,null,null,null,0,0,null,null,null,null,null,null,null,null,null,null,null,null,null,null,null,null,null,null,null,null,null,null,null,null,null,null,null,null,null,null,null,null,null,null,null,null,null,null,null,null,null,null,null,null,null,null,null,null,null,null,null,null,null,null,null,null,null,null,null,null,null,null,null,null,null,null,null,null,null,null,null,null,null,null,null,null,null,null,null,null,null,null,null,null,null,null,null,null,null,null,null,null,null,null,null,null,null,null,null,null,null,null,null,null,null,null,null,null,null,null,null,null,null,null,null,null,null,null,null,null,null,null,null,null,null,null,null,null,null,null,0,0]
[86,null,null,null,null,null,null,null,null,null,null,null,null,null,null,null,null,null,null,null,null,null,null,null,null,null,"",null,null,null,null,null,null,null,null,null,null,null,null,null,null,null,null,null,null,null,null,null,null,null,null,null,null,null,null,null,null,null,null,null,null,null,null,null,null,null,null,null,null,null,null,null,null,null,null,null,null,null,null,null,null,null,null,0,"","","","","","","","","","","","","","","","","","","","","","","","","","","","","","","","","","",null,null,null,null,null,"","","","","","","","",null,null,null,null,null,"","","","","","","","","",null,null,0,{"$f":"IF(Z95<>\"新規\",\"\",IF(AI95=3,基本!$E$14,IF(OR(AI95=1,AI95=2),基本!$E$13,\"\")))","v":""},{"$f":"IF(CF95=0,\"\",IF(AI95=3,基本!$E$16*CF95,IF(OR(AI95=1,AI95=2),基本!$E$15*CF95)))","v":""},{"$f":"IF(AJ95=\"\",\"\",IF(AJ95>0,基本!$E$17*CF95))","v":""},{"$f":"IF(ER95=0,\"\",IF(AM95<=4,基本!$E$18*ER95,IF(AM95>4,基本!$E$19*ER95)))","v":""},{"$f":"IF(AC95=\"\",\"\",IF(AC95>=1,基本!$E$20))","v":""},0,"","","","","","","",null,null,null,null,null,null,null,null,null,null,null,null,null,null,null,null,null,null,null,null,null,null,null,null,null,null,null,null,null,null,null,null,null,null,null,null,null,null,null,null,null,null,null,null,null,null,null,null,null,null,null,null,null,"","","","","","","","","","","","","","","","","","","","","","","","","","","","","","","","","","","","","","",null,null,"","","","","","","","","","","","","","","","","","","","","","","","","","","","","",null,null,null,null,null,null,null,null,null,null,null,null,null,null,null,null,null,null,null,null,null,null,null,null,null,null,null,null,null,null,null,null,null,null,null,null,null,null,null,null,null,null,null,null,null,null,null,null,null,null,null,null,null,null,null,null,null,null,null,null,null,null,null,null,null,null,null,null,null,null,null,null,null,null,null,null,null,null,null,null,null,null,null,null,null,null,null,null,null,null,null,null,null,null,null,null,null,null,null,null,null,null,null,null,null,null,null,null,null,null,null,null,null,null,null,null,null,null,null,null,null,null,null,null,null,null,null,null,null,null,null,null,null,null,null,0,0,null,null,null,null,null,null,null,null,null,null,null,null,null,null,null,null,null,null,null,null,null,null,null,null,null,null,null,null,null,null,null,null,null,null,null,null,null,null,null,null,null,null,null,null,null,null,null,null,null,null,null,null,null,null,null,null,null,null,null,null,null,null,null,null,null,null,null,null,null,null,null,null,null,null,null,null,null,null,null,null,null,null,null,null,null,null,null,null,null,null,null,null,null,null,null,null,null,null,null,null,null,null,null,null,null,null,null,null,null,null,null,null,null,null,null,null,null,null,null,null,null,null,null,null,null,null,null,null,null,null,0,0]
[87,null,null,null,null,null,null,null,null,null,null,null,null,null,null,null,null,null,null,null,null,null,null,null,null,null,"",null,null,null,null,null,null,null,null,null,null,null,null,null,null,null,null,null,null,null,null,null,null,null,null,null,null,null,null,null,null,null,null,null,null,null,null,null,null,null,null,null,null,null,null,null,null,null,null,null,null,null,null,null,null,null,null,0,"","","","","","","","","","","","","","","","","","","","","","","","","","","","","","","","","","",null,null,null,null,null,"","","","","","","","",null,null,null,null,null,"","","","","","","","","",null,null,0,{"$f":"IF(Z96<>\"新規\",\"\",IF(AI96=3,基本!$E$14,IF(OR(AI96=1,AI96=2),基本!$E$13,\"\")))","v":""},{"$f":"IF(CF96=0,\"\",IF(AI96=3,基本!$E$16*CF96,IF(OR(AI96=1,AI96=2),基本!$E$15*CF96)))","v":""},{"$f":"IF(AJ96=\"\",\"\",IF(AJ96>0,基本!$E$17*CF96))","v":""},{"$f":"IF(ER96=0,\"\",IF(AM96<=4,基本!$E$18*ER96,IF(AM96>4,基本!$E$19*ER96)))","v":""},{"$f":"IF(AC96=\"\",\"\",IF(AC96>=1,基本!$E$20))","v":""},0,"","","","","","","",null,null,null,null,null,null,null,null,null,null,null,null,null,null,null,null,null,null,null,null,null,null,null,null,null,null,null,null,null,null,null,null,null,null,null,null,null,null,null,null,null,null,null,null,null,null,null,null,null,null,null,null,null,"","","","","","","","","","","","","","","","","","","","","","","","","","","","","","","","","","","","","","",null,null,"","","","","","","","","","","","","","","","","","","","","","","","","","","","","",null,null,null,null,null,null,null,null,null,null,null,null,null,null,null,null,null,null,null,null,null,null,null,null,null,null,null,null,null,null,null,null,null,null,null,null,null,null,null,null,null,null,null,null,null,null,null,null,null,null,null,null,null,null,null,null,null,null,null,null,null,null,null,null,null,null,null,null,null,null,null,null,null,null,null,null,null,null,null,null,null,null,null,null,null,null,null,null,null,null,null,null,null,null,null,null,null,null,null,null,null,null,null,null,null,null,null,null,null,null,null,null,null,null,null,null,null,null,null,null,null,null,null,null,null,null,null,null,null,null,null,null,null,null,null,0,0,null,null,null,null,null,null,null,null,null,null,null,null,null,null,null,null,null,null,null,null,null,null,null,null,null,null,null,null,null,null,null,null,null,null,null,null,null,null,null,null,null,null,null,null,null,null,null,null,null,null,null,null,null,null,null,null,null,null,null,null,null,null,null,null,null,null,null,null,null,null,null,null,null,null,null,null,null,null,null,null,null,null,null,null,null,null,null,null,null,null,null,null,null,null,null,null,null,null,null,null,null,null,null,null,null,null,null,null,null,null,null,null,null,null,null,null,null,null,null,null,null,null,null,null,null,null,null,null,null,null,0,0]
[88,null,null,null,null,null,null,null,null,null,null,null,null,null,null,null,null,null,null,null,null,null,null,null,null,null,"",null,null,null,null,null,null,null,null,null,null,null,null,null,null,null,null,null,null,null,null,null,null,null,null,null,null,null,null,null,null,null,null,null,null,null,null,null,null,null,null,null,null,null,null,null,null,null,null,null,null,null,null,null,null,null,null,0,"","","","","","","","","","","","","","","","","","","","","","","","","","","","","","","","","","",null,null,null,null,null,"","","","","","","","",null,null,null,null,null,"","","","","","","","","",null,null,0,{"$f":"IF(Z97<>\"新規\",\"\",IF(AI97=3,基本!$E$14,IF(OR(AI97=1,AI97=2),基本!$E$13,\"\")))","v":""},{"$f":"IF(CF97=0,\"\",IF(AI97=3,基本!$E$16*CF97,IF(OR(AI97=1,AI97=2),基本!$E$15*CF97)))","v":""},{"$f":"IF(AJ97=\"\",\"\",IF(AJ97>0,基本!$E$17*CF97))","v":""},{"$f":"IF(ER97=0,\"\",IF(AM97<=4,基本!$E$18*ER97,IF(AM97>4,基本!$E$19*ER97)))","v":""},{"$f":"IF(AC97=\"\",\"\",IF(AC97>=1,基本!$E$20))","v":""},0,"","","","","","","",null,null,null,null,null,null,null,null,null,null,null,null,null,null,null,null,null,null,null,null,null,null,null,null,null,null,null,null,null,null,null,null,null,null,null,null,null,null,null,null,null,null,null,null,null,null,null,null,null,null,null,null,null,"","","","","","","","","","","","","","","","","","","","","","","","","","","","","","","","","","","","","","",null,null,"","","","","","","","","","","","","","","","","","","","","","","","","","","","","",null,null,null,null,null,null,null,null,null,null,null,null,null,null,null,null,null,null,null,null,null,null,null,null,null,null,null,null,null,null,null,null,null,null,null,null,null,null,null,null,null,null,null,null,null,null,null,null,null,null,null,null,null,null,null,null,null,null,null,null,null,null,null,null,null,null,null,null,null,null,null,null,null,null,null,null,null,null,null,null,null,null,null,null,null,null,null,null,null,null,null,null,null,null,null,null,null,null,null,null,null,null,null,null,null,null,null,null,null,null,null,null,null,null,null,null,null,null,null,null,null,null,null,null,null,null,null,null,null,null,null,null,null,null,null,0,0,null,null,null,null,null,null,null,null,null,null,null,null,null,null,null,null,null,null,null,null,null,null,null,null,null,null,null,null,null,null,null,null,null,null,null,null,null,null,null,null,null,null,null,null,null,null,null,null,null,null,null,null,null,null,null,null,null,null,null,null,null,null,null,null,null,null,null,null,null,null,null,null,null,null,null,null,null,null,null,null,null,null,null,null,null,null,null,null,null,null,null,null,null,null,null,null,null,null,null,null,null,null,null,null,null,null,null,null,null,null,null,null,null,null,null,null,null,null,null,null,null,null,null,null,null,null,null,null,null,null,0,0]
[89,null,null,null,null,null,null,null,null,null,null,null,null,null,null,null,null,null,null,null,null,null,null,null,null,null,"",null,null,null,null,null,null,null,null,null,null,null,null,null,null,null,null,null,null,null,null,null,null,null,null,null,null,null,null,null,null,null,null,null,null,null,null,null,null,null,null,null,null,null,null,null,null,null,null,null,null,null,null,null,null,null,null,0,"","","","","","","","","","","","","","","","","","","","","","","","","","","","","","","","","","",null,null,null,null,null,"","","","","","","","",null,null,null,null,null,"","","","","","","","","",null,null,0,{"$f":"IF(Z98<>\"新規\",\"\",IF(AI98=3,基本!$E$14,IF(OR(AI98=1,AI98=2),基本!$E$13,\"\")))","v":""},{"$f":"IF(CF98=0,\"\",IF(AI98=3,基本!$E$16*CF98,IF(OR(AI98=1,AI98=2),基本!$E$15*CF98)))","v":""},{"$f":"IF(AJ98=\"\",\"\",IF(AJ98>0,基本!$E$17*CF98))","v":""},{"$f":"IF(ER98=0,\"\",IF(AM98<=4,基本!$E$18*ER98,IF(AM98>4,基本!$E$19*ER98)))","v":""},{"$f":"IF(AC98=\"\",\"\",IF(AC98>=1,基本!$E$20))","v":""},0,"","","","","","","",null,null,null,null,null,null,null,null,null,null,null,null,null,null,null,null,null,null,null,null,null,null,null,null,null,null,null,null,null,null,null,null,null,null,null,null,null,null,null,null,null,null,null,null,null,null,null,null,null,null,null,null,null,"","","","","","","","","","","","","","","","","","","","","","","","","","","","","","","","","","","","","","",null,null,"","","","","","","","","","","","","","","","","","","","","","","","","","","","","",null,null,null,null,null,null,null,null,null,null,null,null,null,null,null,null,null,null,null,null,null,null,null,null,null,null,null,null,null,null,null,null,null,null,null,null,null,null,null,null,null,null,null,null,null,null,null,null,null,null,null,null,null,null,null,null,null,null,null,null,null,null,null,null,null,null,null,null,null,null,null,null,null,null,null,null,null,null,null,null,null,null,null,null,null,null,null,null,null,null,null,null,null,null,null,null,null,null,null,null,null,null,null,null,null,null,null,null,null,null,null,null,null,null,null,null,null,null,null,null,null,null,null,null,null,null,null,null,null,null,null,null,null,null,null,0,0,null,null,null,null,null,null,null,null,null,null,null,null,null,null,null,null,null,null,null,null,null,null,null,null,null,null,null,null,null,null,null,null,null,null,null,null,null,null,null,null,null,null,null,null,null,null,null,null,null,null,null,null,null,null,null,null,null,null,null,null,null,null,null,null,null,null,null,null,null,null,null,null,null,null,null,null,null,null,null,null,null,null,null,null,null,null,null,null,null,null,null,null,null,null,null,null,null,null,null,null,null,null,null,null,null,null,null,null,null,null,null,null,null,null,null,null,null,null,null,null,null,null,null,null,null,null,null,null,null,null,0,0]
[90,null,null,null,null,null,null,null,null,null,null,null,null,null,null,null,null,null,null,null,null,null,null,null,null,null,null,null,null,null,null,null,null,null,null,null,null,null,null,null,null,null,null,null,null,null,null,null,null,null,null,null,null,null,null,null,null,null,null,null,null,null,null,null,null,null,null,null,null,null,null,null,null,null,null,null,null,null,null,null,null,null,null,{"$f":"COUNTA(BA99:CE99)","v":0},{"$f":"IF(K99=0,\"\",K99)","v":""},{"$f":"IF(G99=0,\"\",G99)","v":""},{"$f":"IF(LEN(CH99)=0,\"\",LEN(CH99))","v":""},{"$f":"IF(CI99=2,LEFT(CH99),\"\")","v":""},{"$f":"IF(CH99=\"\",\"\",RIGHT(CH99))","v":""},{"$f":"IF(H99=0,\"\",H99)","v":""},{"$f":"IF(LEN(CL99)=0,\"\",LEN(CL99))","v":""},{"$f":"IF(CM99=3,LEFT(CL99),\"\")","v":""},{"$f":"IF(CM99=3,MID(CL99,2,1),IF(CM99=2,LEFT(CL99),\"\"))","v":""},{"$f":"RIGHT(CL99)","v":""},{"$f":"IF(I99=0,\"\",I99)","v":""},{"$f":"IF(LEN(CQ99)=0,\"\",LEN(CQ99))","v":""},{"$f":"IF(CR99=7,LEFT(CQ99),\"\")","v":""},{"$f":"IF(CR99=6,MID(CQ99,2,1),IF(CR99=5,LEFT(CQ99),\"\"))","v":""},{"$f":"IF(CR99=6,MID(CQ99,3,1),IF(CR99=5,MID(CQ99,2,1),IF(CR99=4,LEFT(CQ99),\"\")))","v":""},{"$f":"IF(CR99=6,MID(CQ99,4,1),IF(CR99=5,MID(CQ99,3,1),IF(CR99=4,MID(CQ99,2,1),IF(CR99=3,LEFT(CQ99),\"\"))))","v":""},{"$f":"IF(CR99=6,MID(CQ99,5,1),IF(CR99=5,MID(CQ99,4,1),IF(CR99=4,MID(CQ99,3,1),IF(CR99=3,MID(CQ99,2,1),IF(CR99=2,LEFT(CQ99),\"\")))))","v":""},{"$f":"IF(RIGHT(CR99)=0,\"\",RIGHT(CQ99))","v":""},{"$f":"IF(T99=0,\"\",T99)","v":""},{"$f":"LEFT(CY99)","v":""},{"$f":"MID(CY99,2,2)","v":""},{"$f":"MID(CY99,5,2)","v":""},{"$f":"MID(CY99,8,2)","v":""},"",{"$f":"IF(DD99=\"\",\"\",DD99+DA99)","v":""},{"$f":"IF(DD99=\"\",\"\",DATE(DE99,DB99,DC99))","v":""},{"$f":"IF(DD99=\"\",\"\",DATEDIF(DF99,TODAY(),\"Y\"))","v":""},{"$f":"LEFT(DG99)","v":""},{"$f":"MID(DG99,2,1)","v":""},{"$f":"MID(DG99,3,1)","v":""},{"$f":"MID(DG99,5,1)","v":""},{"$f":"MID(DG99,6,1)","v":""},{"$f":"MID(DG99,7,1)","v":""},{"$f":"MID(DG99,8,1)","v":""},null,null,null,null,null,{"$f":"IF(Y99=0,\"\",Y99)","v":""},{"$f":"LEFT(DT99)","v":""},{"$f":"MID(DT99,2,2)","v":""},{"$f":"MID(DT99,5,2)","v":""},{"$f":"MID(DT99,8,2)","v":""},{"$f":"IF(DW99=\"\",\"\",VALUE(DW99))","v":""},{"$f":"IF(DV99=\"\",\"\",IF(VALUE(DV99)=$CW$6,IF(VALUE(DW99)=$CW$5,DX99,1),1))","v":""},{"$f":"IF(DV99=\"\",\"\",$CZ$5)","v":""},null,null,null,null,null,{"$f":"IF(DZ99=1,0,LEFT(DZ99))","v":""},{"$f":"IF(DZ99=1,1,RIGHT(DZ99))","v":""},{"$f":"LEFT(EA99)","v":""},{"$f":"MID(EA99,2,1)","v":""},{"$f":"IF(W99=0,\"\",W99)","v":""},{"$f":"IF(EK99=\"不詳\",\"\",IF(EK99=\"不明\",\"\",MID(EK99,2,2)))","v":""},{"$f":"MID(EK99,5,2)","v":""},{"$f":"MID(EK99,8,2)","v":""},{"$f":"LEFT(EK99)","v":""},null,null,{"$f":"COUNTIF(BA99:CE99,\"◎\")","v":0},{"$f":"IF(Z99<>\"新規\",\"\",IF(AI99=3,基本!$E$14,IF(OR(AI99=1,AI99=2),基本!$E$13,\"\")))","v":""},{"$f":"IF(CF99=0,\"\",IF(AI99=3,基本!$E$16*CF99,IF(OR(AI99=1,AI99=2),基本!$E$15*CF99)))","v":""},{"$f":"IF(AJ99=\"\",\"\",IF(AJ99>0,基本!$E$17*CF99))","v":""},{"$f":"IF(ER99=0,\"\",IF(AM99<=4,基本!$E$18*ER99,IF(AM99>4,基本!$E$19*ER99)))","v":""},{"$f":"IF(AC99=\"\",\"\",IF(AC99>=1,基本!$E$20))","v":""},{"$f":"SUM(ES99:EW99)","v":0},"","","","","","","",null,null,null,null,null,null,null,null,null,null,null,null,null,null,null,null,null,null,null,null,null,null,null,null,null,null,null,null,null,null,null,null,null,null,null,null,null,null,null,null,null,null,null,null,null,null,null,null,null,null,null,null,null,{"$f":"IF(AT99=0,\"\",AT99)","v":""},{"$f":"LEFT(HG99,1)","v":""},{"$f":"MID(HG99,2,2)","v":""},{"$f":"MID(HG99,5,2)","v":""},{"$f":"MID(HG99,8,2)","v":""},{"$f":"IF(LEFT(V99,3)=\"神経痛\",1,IF(LEFT(V99,3)=\"リウマ\",2,IF(LEFT(V99,3)=\"頚腕症\",3,IF(LEFT(V99,3)=\"五十肩\",4,IF(LEFT(V99,3)=\"腰痛症\",5,IF(LEFT(V99,3)=\"頚椎捻\",6,\"\"))))))","v":""},{"$f":"IF(OR(BA99=\"○\",BA99=\"◎\"),1,\"\")","v":""},{"$f":"IF(OR(BB99=\"○\",BB99=\"◎\"),2,\"\")","v":""},{"$f":"IF(OR(BC99=\"○\",BC99=\"◎\"),3,\"\")","v":""},{"$f":"IF(OR(BD99=\"○\",BD99=\"◎\"),4,\"\")","v":""},{"$f":"IF(OR(BE99=\"○\",BE99=\"◎\"),5,\"\")","v":""},{"$f":"IF(OR(BF99=\"○\",BF99=\"◎\"),6,\"\")","v":""},{"$f":"IF(OR(BG99=\"○\",BG99=\"◎\"),7,\"\")","v":""},{"$f":"IF(OR(BH99=\"○\",BH99=\"◎\"),8,\"\")","v":""},{"$f":"IF(OR(BI99=\"○\",BI99=\"◎\"),9,\"\")","v":""},{"$f":"IF(OR(BJ99=\"○\",BJ99=\"◎\"),10,\"\")","v":""},{"$f":"IF(OR(BK99=\"○\",BK99=\"◎\"),11,\"\")","v":""},{"$f":"IF(OR(BL99=\"○\",BL99=\"◎\"),12,\"\")","v":""},{"$f":"IF(OR(BM99=\"○\",BM99=\"◎\"),13,\"\")","v":""},{"$f":"IF(OR(BN99=\"○\",BN99=\"◎\"),14,\"\")","v":""},{"$f":"IF(OR(BO99=\"○\",BO99=\"◎\"),15,\"\")","v":""},{"$f":"IF(OR(BP99=\"○\",BP99=\"◎\"),16,\"\")","v":""},{"$f":"IF(OR(BQ99=\"○\",BQ99=\"◎\"),17,\"\")","v":""},{"$f":"IF(OR(BR99=\"○\",BR99=\"◎\"),18,\"\")","v":""},{"$f":"IF(OR(BS99=\"○\",BS99=\"◎\"),19,\"\")","v":""},{"$f":"IF(OR(BT99=\"○\",BT99=\"◎\"),20,\"\")","v":""},{"$f":"IF(OR(BU99=\"○\",BU99=\"◎\"),21,\"\")","v":""},{"$f":"IF(OR(BV99=\"○\",BV99=\"◎\"),22,\"\")","v":""},{"$f":"IF(OR(BW99=\"○\",BW99=\"◎\"),23,\"\")","v":""},{"$f":"IF(OR(BX99=\"○\",BX99=\"◎\"),24,\"\")","v":""},{"$f":"IF(OR(BY99=\"○\",BY99=\"◎\"),25,\"\")","v":""},{"$f":"IF(OR(BZ99=\"○\",BZ99=\"◎\"),26,\"\")","v":""},{"$f":"IF(OR(CA99=\"○\",CA99=\"◎\"),27,\"\")","v":""},{"$f":"IF(OR(CB99=\"○\",CB99=\"◎\"),28,\"\")","v":""},{"$f":"IF(OR(CC99=\"○\",CC99=\"◎\"),29,\"\")","v":""},{"$f":"IF(OR(CD99=\"○\",CD99=\"◎\"),30,\"\")","v":""},{"$f":"IF(OR(CE99=\"○\",CE99=\"◎\"),31,\"\")","v":""},{"$f":"IF(MAX(HM99:IQ99)=0,\"\",MAX(HM99:IQ99))","v":""},null,null,{"$f":"IF(G99=\"\",\"\",G99)","v":""},{"$f":"IF(LEN(IU99)=0,\"\",LEN(IU99))","v":""},{"$f":"IF(IV99=8,LEFT(IU99),\"\")","v":""},{"$f":"IF(IV99=8,MID(IU99,2,1),IF(IV99=7,LEFT(IU99),\"\"))","v":""},{"$f":"IF(IV99=8,MID(IU99,3,1),IF(IV99=7,MID(IU99,2,1),IF(IV99=6,LEFT(IU99),\"\")))","v":""},{"$f":"IF(IV99=8,MID(IU99,4,1),IF(IV99=7,MID(IU99,3,1),IF(IV99=6,MID(IU99,2,1),IF(IV99=5,LEFT(IU99),\"\"))))","v":""},{"$f":"IF(IV99=8,MID(IU99,5,1),IF(IV99=7,MID(IU99,4,1),IF(IV99=6,MID(IU99,3,1),IF(IV99=5,MID(IU99,2,1),IF(IV99=4,LEFT(IU99),\"\")))))","v":""},{"$f":"IF(IV99=8,MID(IU99,6,1),IF(IV99=7,MID(IU99,5,1),IF(IV99=6,MID(IU99,4,1),IF(IV99=5,MID(IU99,3,1),IF(IV99=4,MID(IU99,2,1),IF(IV99=3,LEFT(IU99),\"\"))))))","v":""},{"$f":"IF(IV99=8,MID(IU99,7,1),IF(IV99=7,MID(IU99,6,1),IF(IV99=6,MID(IU99,5,1),IF(IV99=5,MID(IU99,4,1),IF(IV99=4,MID(IU99,3,1),IF(IV99=3,MID(IU99,2,1),IF(IV99=2,LEFT(IU99),\"\")))))))","v":""},{"$f":"IF(RIGHT(IV99)=0,\"\",RIGHT(IU99))","v":""},{"$f":"IF(H99=\"\",\"\",H99)","v":""},{"$f":"IF(LEN(JE99)=0,\"\",LEN(JE99))","v":""},{"$f":"IF(JF99=7,LEFT(JE99),\"\")","v":""},{"$f":"IF(JF99=7,MID(JE99,2,1),IF(JF99=6,LEFT(JE99),\"\"))","v":""},{"$f":"IF(JF99=7,MID(JE99,3,1),IF(JF99=6,MID(JE99,2,1),IF(JF99=5,LEFT(JE99,1),\"\")))","v":""},{"$f":"IF(JF99=7,MID(JE99,4,1),IF(JF99=6,MID(JE99,3,1),IF(JF99=5,MID(JE99,2,1),IF(JF99=4,LEFT(JE99,1),\"\"))))","v":""},{"$f":"IF(JF99=7,MID(JE99,5,1),IF(JF99=6,MID(JE99,4,1),IF(JF99=5,MID(JE99,3,1),IF(JF99=4,MID(JE99,2,1),IF(JF99=3,LEFT(JE99,1),\"\")))))","v":""},{"$f":"IF(JF99=7,MID(JE99,6,1),IF(JF99=6,MID(JE99,5,1),IF(JF99=5,MID(JE99,4,1),IF(JF99=4,MID(JE99,3,1),IF(JF99=3,MID(JE99,2,1),\"\")))))","v":""},{"$f":"IF(RIGHT(JE99)=0,\"\",RIGHT(JE99))","v":""},{"$f":"IF(B99=\"\",\"\",B99)","v":""},{"$f":"IF(LEN(JN99)=0,\"\",LEN(JN99))","v":""},{"$f":"IF(JO99=8,LEFT(JN99),\"\")","v":""},{"$f":"IF(JO99=8,MID(JN99,2,1),IF(JO99=7,LEFT(JN99),\"\"))","v":""},{"$f":"IF(JO99=8,MID(JN99,3,1),IF(JO99=7,MID(JN99,2,1),IF(JO99=6,LEFT(JN99),\"\")))","v":""},{"$f":"IF(JO99=8,MID(JN99,4,1),IF(JO99=7,MID(JN99,3,1),IF(JO99=6,MID(JN99,2,1),IF(JO99=5,LEFT(JN99),\"\"))))","v":""},"",{"$f":"IF(JO99=8,MID(JN99,6,1),IF(JO99=7,MID(JN99,5,1),IF(JO99=6,MID(JN99,4,1),IF(JO99=5,MID(JN99,3,1),IF(JO99=4,MID(JN99,2,1),IF(JO99=3,LEFT(JN99),\"\"))))))","v":""},{"$f":"IF(JO99=8,MID(JN99,7,1),IF(JO99=7,MID(JN99,6,1),IF(JO99=6,MID(JN99,5,1),IF(JO99=5,MID(JN99,4,1),IF(JO99=4,MID(JN99,3,1),IF(JO99=3,MID(JN99,2,1),IF(JO99=2,LEFT(JN99),\"\")))))))","v":""},{"$f":"IF(RIGHT(JO99)=0,\"\",RIGHT(JN99))","v":""},null,null,null,null,null,null,null,null,null,null,null,null,null,null,null,null,null,null,null,null,null,null,null,null,null,null,null,null,null,null,null,null,null,null,null,null,null,null,null,null,null,null,null,null,null,null,null,null,null,null,null,null,null,null,null,null,null,null,null,null,null,null,null,null,null,null,null,null,null,null,null,null,null,null,null,null,null,null,null,null,null,null,null,null,null,null,null,null,null,null,null,null,null,null,null,null,null,null,null,null,null,null,null,null,null,null,null,null,null,null,null,null,null,null,null,null,null,null,null,null,null,null,null,null,null,null,null,null,null,null,null,null,null,null,null,0,0,null,null,null,null,null,null,null,null,null,null,null,null,null,null,null,null,null,null,null,null,null,null,null,null,null,null,null,null,null,null,null,null,null,null,null,null,null,null,null,null,null,null,null,null,null,null,null,null,null,null,null,null,null,null,null,null,null,null,null,null,null,null,null,null,null,null,null,null,null,null,null,null,null,null,null,null,null,null,null,null,null,null,null,null,null,null,null,null,null,null,null,null,null,null,null,null,null,null,null,null,null,null,null,null,null,null,null,null,null,null,null,null,null,null,null,null,null,null,null,null,null,null,null,null,null,null,null,null,null,null,0,0]
[91,null,null,null,null,null,null,null,null,null,null,null,null,null,null,null,null,null,null,null,null,null,null,null,null,null,null,null,null,null,null,null,null,null,null,null,null,null,null,null,null,null,null,null,null,null,null,null,null,null,null,null,null,null,null,null,null,null,null,null,null,null,null,null,null,null,null,null,null,null,null,null,null,null,null,null,null,null,null,null,null,null,null,0,"","","","","","","","","","","","","","","","","","","","","","","","","","","","","","","","","","",null,null,null,null,null,"","","","","","","","",null,null,null,null,null,"","","","","","","","","",null,null,0,{"$f":"IF(Z100<>\"新規\",\"\",IF(AI100=3,基本!$E$14,IF(OR(AI100=1,AI100=2),基本!$E$13,\"\")))","v":""},{"$f":"IF(CF100=0,\"\",IF(AI100=3,基本!$E$16*CF100,IF(OR(AI100=1,AI100=2),基本!$E$15*CF100)))","v":""},{"$f":"IF(AJ100=\"\",\"\",IF(AJ100>0,基本!$E$17*CF100))","v":""},{"$f":"IF(ER100=0,\"\",IF(AM100<=4,基本!$E$18*ER100,IF(AM100>4,基本!$E$19*ER100)))","v":""},{"$f":"IF(AC100=\"\",\"\",IF(AC100>=1,基本!$E$20))","v":""},0,"","","","","","","",null,null,null,null,null,null,null,null,null,null,null,null,null,null,null,null,null,null,null,null,null,null,null,null,null,null,null,null,null,null,null,null,null,null,null,null,null,null,null,null,null,null,null,null,null,null,null,null,null,null,null,null,null,"","","","","","","","","","","","","","","","","","","","","","","","","","","","","","","","","","","","","","",null,null,"","","","","","","","","","","","","","","","","","","","","","","","","","","","","",null,null,null,null,null,null,null,null,null,null,null,null,null,null,null,null,null,null,null,null,null,null,null,null,null,null,null,null,null,null,null,null,null,null,null,null,null,null,null,null,null,null,null,null,null,null,null,null,null,null,null,null,null,null,null,null,null,null,null,null,null,null,null,null,null,null,null,null,null,null,null,null,null,null,null,null,null,null,null,null,null,null,null,null,null,null,null,null,null,null,null,null,null,null,null,null,null,null,null,null,null,null,null,null,null,null,null,null,null,null,null,null,null,null,null,null,null,null,null,null,null,null,null,null,null,null,null,null,null,null,null,null,null,null,null,0,0,null,null,null,null,null,null,null,null,null,null,null,null,null,null,null,null,null,null,null,null,null,null,null,null,null,null,null,null,null,null,null,null,null,null,null,null,null,null,null,null,null,null,null,null,null,null,null,null,null,null,null,null,null,null,null,null,null,null,null,null,null,null,null,null,null,null,null,null,null,null,null,null,null,null,null,null,null,null,null,null,null,null,null,null,null,null,null,null,null,null,null,null,null,null,null,null,null,null,null,null,null,null,null,null,null,null,null,null,null,null,null,null,null,null,null,null,null,null,null,null,null,null,null,null,null,null,null,null,null,null,0,0]
[92,null,null,null,null,null,null,null,null,null,null,null,null,null,null,null,null,null,null,null,null,null,null,null,null,null,null,null,null,null,null,null,null,null,null,null,null,null,null,null,null,null,null,null,null,null,null,null,null,null,null,null,null,null,null,null,null,null,null,null,null,null,null,null,null,null,null,null,null,null,null,null,null,null,null,null,null,null,null,null,null,null,null,0,"","","","","","","","","","","","","","","","","","","","","","","","","","","","","","","","","","",null,null,null,null,null,"","","","","","","","",null,null,null,null,null,"","","","","","","","","",null,null,0,{"$f":"IF(Z101<>\"新規\",\"\",IF(AI101=3,基本!$E$14,IF(OR(AI101=1,AI101=2),基本!$E$13,\"\")))","v":""},{"$f":"IF(CF101=0,\"\",IF(AI101=3,基本!$E$16*CF101,IF(OR(AI101=1,AI101=2),基本!$E$15*CF101)))","v":""},{"$f":"IF(AJ101=\"\",\"\",IF(AJ101>0,基本!$E$17*CF101))","v":""},{"$f":"IF(ER101=0,\"\",IF(AM101<=4,基本!$E$18*ER101,IF(AM101>4,基本!$E$19*ER101)))","v":""},{"$f":"IF(AC101=\"\",\"\",IF(AC101>=1,基本!$E$20))","v":""},0,"","","","","","","",null,null,null,null,null,null,null,null,null,null,null,null,null,null,null,null,null,null,null,null,null,null,null,null,null,null,null,null,null,null,null,null,null,null,null,null,null,null,null,null,null,null,null,null,null,null,null,null,null,null,null,null,null,"","","","","","","","","","","","","","","","","","","","","","","","","","","","","","","","","","","","","","",null,null,"","","","","","","","","","","","","","","","","","","","","","","","","","","","","",null,null,null,null,null,null,null,null,null,null,null,null,null,null,null,null,null,null,null,null,null,null,null,null,null,null,null,null,null,null,null,null,null,null,null,null,null,null,null,null,null,null,null,null,null,null,null,null,null,null,null,null,null,null,null,null,null,null,null,null,null,null,null,null,null,null,null,null,null,null,null,null,null,null,null,null,null,null,null,null,null,null,null,null,null,null,null,null,null,null,null,null,null,null,null,null,null,null,null,null,null,null,null,null,null,null,null,null,null,null,null,null,null,null,null,null,null,null,null,null,null,null,null,null,null,null,null,null,null,null,null,null,null,null,null,0,0,null,null,null,null,null,null,null,null,null,null,null,null,null,null,null,null,null,null,null,null,null,null,null,null,null,null,null,null,null,null,null,null,null,null,null,null,null,null,null,null,null,null,null,null,null,null,null,null,null,null,null,null,null,null,null,null,null,null,null,null,null,null,null,null,null,null,null,null,null,null,null,null,null,null,null,null,null,null,null,null,null,null,null,null,null,null,null,null,null,null,null,null,null,null,null,null,null,null,null,null,null,null,null,null,null,null,null,null,null,null,null,null,null,null,null,null,null,null,null,null,null,null,null,null,null,null,null,null,null,null,0,0]
[93,null,null,null,null,null,null,null,null,null,null,null,null,null,null,null,null,null,null,null,null,null,null,null,null,null,null,null,null,null,null,null,null,null,null,null,null,null,null,null,null,null,null,null,null,null,null,null,null,null,null,null,null,null,null,null,null,null,null,null,null,null,null,null,null,null,null,null,null,null,null,null,null,null,null,null,null,null,null,null,null,null,null,0,"","","","","","","","","","","","","","","","","","","","","","","","","","","","","","","","","","",null,null,null,null,null,"","","","","","","","",null,null,null,null,null,"","","","","","","","","",null,null,0,{"$f":"IF(Z102<>\"新規\",\"\",IF(AI102=3,基本!$E$14,IF(OR(AI102=1,AI102=2),基本!$E$13,\"\")))","v":""},{"$f":"IF(CF102=0,\"\",IF(AI102=3,基本!$E$16*CF102,IF(OR(AI102=1,AI102=2),基本!$E$15*CF102)))","v":""},{"$f":"IF(AJ102=\"\",\"\",IF(AJ102>0,基本!$E$17*CF102))","v":""},{"$f":"IF(ER102=0,\"\",IF(AM102<=4,基本!$E$18*ER102,IF(AM102>4,基本!$E$19*ER102)))","v":""},{"$f":"IF(AC102=\"\",\"\",IF(AC102>=1,基本!$E$20))","v":""},0,"","","","","","","",null,null,null,null,null,null,null,null,null,null,null,null,null,null,null,null,null,null,null,null,null,null,null,null,null,null,null,null,null,null,null,null,null,null,null,null,null,null,null,null,null,null,null,null,null,null,null,null,null,null,null,null,null,"","","","","","","","","","","","","","","","","","","","","","","","","","","","","","","","","","","","","","",null,null,"","","","","","","","","","","","","","","","","","","","","","","","","","","","","",null,null,null,null,null,null,null,null,null,null,null,null,null,null,null,null,null,null,null,null,null,null,null,null,null,null,null,null,null,null,null,null,null,null,null,null,null,null,null,null,null,null,null,null,null,null,null,null,null,null,null,null,null,null,null,null,null,null,null,null,null,null,null,null,null,null,null,null,null,null,null,null,null,null,null,null,null,null,null,null,null,null,null,null,null,null,null,null,null,null,null,null,null,null,null,null,null,null,null,null,null,null,null,null,null,null,null,null,null,null,null,null,null,null,null,null,null,null,null,null,null,null,null,null,null,null,null,null,null,null,null,null,null,null,null,0,0,null,null,null,null,null,null,null,null,null,null,null,null,null,null,null,null,null,null,null,null,null,null,null,null,null,null,null,null,null,null,null,null,null,null,null,null,null,null,null,null,null,null,null,null,null,null,null,null,null,null,null,null,null,null,null,null,null,null,null,null,null,null,null,null,null,null,null,null,null,null,null,null,null,null,null,null,null,null,null,null,null,null,null,null,null,null,null,null,null,null,null,null,null,null,null,null,null,null,null,null,null,null,null,null,null,null,null,null,null,null,null,null,null,null,null,null,null,null,null,null,null,null,null,null,null,null,null,null,null,null,0,0]
[94,null,null,null,null,null,null,null,null,null,null,null,null,null,null,null,null,null,null,null,null,null,null,null,null,null,null,null,null,null,null,null,null,null,null,null,null,null,null,null,null,null,null,null,null,null,null,null,null,null,null,null,null,null,null,null,null,null,null,null,null,null,null,null,null,null,null,null,null,null,null,null,null,null,null,null,null,null,null,null,null,null,null,0,"","","","","","","","","","","","","","","","","","","","","","","","","","","","","","","","","","",null,null,null,null,null,"","","","","","","","",null,null,null,null,null,"","","","","","","","","",null,null,0,{"$f":"IF(Z103<>\"新規\",\"\",IF(AI103=3,基本!$E$14,IF(OR(AI103=1,AI103=2),基本!$E$13,\"\")))","v":""},{"$f":"IF(CF103=0,\"\",IF(AI103=3,基本!$E$16*CF103,IF(OR(AI103=1,AI103=2),基本!$E$15*CF103)))","v":""},{"$f":"IF(AJ103=\"\",\"\",IF(AJ103>0,基本!$E$17*CF103))","v":""},{"$f":"IF(ER103=0,\"\",IF(AM103<=4,基本!$E$18*ER103,IF(AM103>4,基本!$E$19*ER103)))","v":""},{"$f":"IF(AC103=\"\",\"\",IF(AC103>=1,基本!$E$20))","v":""},0,"","","","","","","",null,null,null,null,null,null,null,null,null,null,null,null,null,null,null,null,null,null,null,null,null,null,null,null,null,null,null,null,null,null,null,null,null,null,null,null,null,null,null,null,null,null,null,null,null,null,null,null,null,null,null,null,null,"","","","","","","","","","","","","","","","","","","","","","","","","","","","","","","","","","","","","","",null,null,"","","","","","","","","","","","","","","","","","","","","","","","","","","","","",null,null,null,null,null,null,null,null,null,null,null,null,null,null,null,null,null,null,null,null,null,null,null,null,null,null,null,null,null,null,null,null,null,null,null,null,null,null,null,null,null,null,null,null,null,null,null,null,null,null,null,null,null,null,null,null,null,null,null,null,null,null,null,null,null,null,null,null,null,null,null,null,null,null,null,null,null,null,null,null,null,null,null,null,null,null,null,null,null,null,null,null,null,null,null,null,null,null,null,null,null,null,null,null,null,null,null,null,null,null,null,null,null,null,null,null,null,null,null,null,null,null,null,null,null,null,null,null,null,null,null,null,null,null,null,0,0,null,null,null,null,null,null,null,null,null,null,null,null,null,null,null,null,null,null,null,null,null,null,null,null,null,null,null,null,null,null,null,null,null,null,null,null,null,null,null,null,null,null,null,null,null,null,null,null,null,null,null,null,null,null,null,null,null,null,null,null,null,null,null,null,null,null,null,null,null,null,null,null,null,null,null,null,null,null,null,null,null,null,null,null,null,null,null,null,null,null,null,null,null,null,null,null,null,null,null,null,null,null,null,null,null,null,null,null,null,null,null,null,null,null,null,null,null,null,null,null,null,null,null,null,null,null,null,null,null,null,0,0]
[95,null,null,null,null,null,null,null,null,null,null,null,null,null,null,null,null,null,null,null,null,null,null,null,null,null,null,null,null,null,null,null,null,null,null,null,null,null,null,null,null,null,null,null,null,null,null,null,null,null,null,null,null,null,null,null,null,null,null,null,null,null,null,null,null,null,null,null,null,null,null,null,null,null,null,null,null,null,null,null,null,null,null,0,"","","","","","","","","","","","","","","","","","","","","","","","","","","","","","","","","","",null,null,null,null,null,"","","","","","","","",null,null,null,null,null,"","","","","","","","","",null,null,0,{"$f":"IF(Z104<>\"新規\",\"\",IF(AI104=3,基本!$E$14,IF(OR(AI104=1,AI104=2),基本!$E$13,\"\")))","v":""},{"$f":"IF(CF104=0,\"\",IF(AI104=3,基本!$E$16*CF104,IF(OR(AI104=1,AI104=2),基本!$E$15*CF104)))","v":""},{"$f":"IF(AJ104=\"\",\"\",IF(AJ104>0,基本!$E$17*CF104))","v":""},{"$f":"IF(ER104=0,\"\",IF(AM104<=4,基本!$E$18*ER104,IF(AM104>4,基本!$E$19*ER104)))","v":""},{"$f":"IF(AC104=\"\",\"\",IF(AC104>=1,基本!$E$20))","v":""},0,"","","","","","","",null,null,null,null,null,null,null,null,null,null,null,null,null,null,null,null,null,null,null,null,null,null,null,null,null,null,null,null,null,null,null,null,null,null,null,null,null,null,null,null,null,null,null,null,null,null,null,null,null,null,null,null,null,"","","","","","","","","","","","","","","","","","","","","","","","","","","","","","","","","","","","","","",null,null,"","","","","","","","","","","","","","","","","","","","","","","","","","","","","",null,null,null,null,null,null,null,null,null,null,null,null,null,null,null,null,null,null,null,null,null,null,null,null,null,null,null,null,null,null,null,null,null,null,null,null,null,null,null,null,null,null,null,null,null,null,null,null,null,null,null,null,null,null,null,null,null,null,null,null,null,null,null,null,null,null,null,null,null,null,null,null,null,null,null,null,null,null,null,null,null,null,null,null,null,null,null,null,null,null,null,null,null,null,null,null,null,null,null,null,null,null,null,null,null,null,null,null,null,null,null,null,null,null,null,null,null,null,null,null,null,null,null,null,null,null,null,null,null,null,null,null,null,null,null,0,0,null,null,null,null,null,null,null,null,null,null,null,null,null,null,null,null,null,null,null,null,null,null,null,null,null,null,null,null,null,null,null,null,null,null,null,null,null,null,null,null,null,null,null,null,null,null,null,null,null,null,null,null,null,null,null,null,null,null,null,null,null,null,null,null,null,null,null,null,null,null,null,null,null,null,null,null,null,null,null,null,null,null,null,null,null,null,null,null,null,null,null,null,null,null,null,null,null,null,null,null,null,null,null,null,null,null,null,null,null,null,null,null,null,null,null,null,null,null,null,null,null,null,null,null,null,null,null,null,null,null,0,0]
[96,null,null,null,null,null,null,null,null,null,null,null,null,null,null,null,null,null,null,null,null,null,null,null,null,null,null,null,null,null,null,null,null,null,null,null,null,null,null,null,null,null,null,null,null,null,null,null,null,null,null,null,null,null,null,null,null,null,null,null,null,null,null,null,null,null,null,null,null,null,null,null,null,null,null,null,null,null,null,null,null,null,null,0,"","","","","","","","","","","","","","","","","","","","","","","","","","","","","","","","","","",null,null,null,null,null,"","","","","","","","",null,null,null,null,null,"","","","","","","","","",null,null,0,{"$f":"IF(Z105<>\"新規\",\"\",IF(AI105=3,基本!$E$14,IF(OR(AI105=1,AI105=2),基本!$E$13,\"\")))","v":""},{"$f":"IF(CF105=0,\"\",IF(AI105=3,基本!$E$16*CF105,IF(OR(AI105=1,AI105=2),基本!$E$15*CF105)))","v":""},{"$f":"IF(AJ105=\"\",\"\",IF(AJ105>0,基本!$E$17*CF105))","v":""},{"$f":"IF(ER105=0,\"\",IF(AM105<=4,基本!$E$18*ER105,IF(AM105>4,基本!$E$19*ER105)))","v":""},{"$f":"IF(AC105=\"\",\"\",IF(AC105>=1,基本!$E$20))","v":""},0,"","","","","","","",null,null,null,null,null,null,null,null,null,null,null,null,null,null,null,null,null,null,null,null,null,null,null,null,null,null,null,null,null,null,null,null,null,null,null,null,null,null,null,null,null,null,null,null,null,null,null,null,null,null,null,null,null,"","","","","","","","","","","","","","","","","","","","","","","","","","","","","","","","","","","","","","",null,null,"","","","","","","","","","","","","","","","","","","","","","","","","","","","","",null,null,null,null,null,null,null,null,null,null,null,null,null,null,null,null,null,null,null,null,null,null,null,null,null,null,null,null,null,null,null,null,null,null,null,null,null,null,null,null,null,null,null,null,null,null,null,null,null,null,null,null,null,null,null,null,null,null,null,null,null,null,null,null,null,null,null,null,null,null,null,null,null,null,null,null,null,null,null,null,null,null,null,null,null,null,null,null,null,null,null,null,null,null,null,null,null,null,null,null,null,null,null,null,null,null,null,null,null,null,null,null,null,null,null,null,null,null,null,null,null,null,null,null,null,null,null,null,null,null,null,null,null,null,null,0,0,null,null,null,null,null,null,null,null,null,null,null,null,null,null,null,null,null,null,null,null,null,null,null,null,null,null,null,null,null,null,null,null,null,null,null,null,null,null,null,null,null,null,null,null,null,null,null,null,null,null,null,null,null,null,null,null,null,null,null,null,null,null,null,null,null,null,null,null,null,null,null,null,null,null,null,null,null,null,null,null,null,null,null,null,null,null,null,null,null,null,null,null,null,null,null,null,null,null,null,null,null,null,null,null,null,null,null,null,null,null,null,null,null,null,null,null,null,null,null,null,null,null,null,null,null,null,null,null,null,null,0,0]
[97,null,null,null,null,null,null,null,null,null,null,null,null,null,null,null,null,null,null,null,null,null,null,null,null,null,null,null,null,null,null,null,null,null,null,null,null,null,null,null,null,null,null,null,null,null,null,null,null,null,null,null,null,null,null,null,null,null,null,null,null,null,null,null,null,null,null,null,null,null,null,null,null,null,null,null,null,null,null,null,null,null,null,0,"","","","","","","","","","","","","","","","","","","","","","","","","","","","","","","","","","",null,null,null,null,null,"","","","","","","","",null,null,null,null,null,"","","","","","","","","",null,null,0,{"$f":"IF(Z106<>\"新規\",\"\",IF(AI106=3,基本!$E$14,IF(OR(AI106=1,AI106=2),基本!$E$13,\"\")))","v":""},{"$f":"IF(CF106=0,\"\",IF(AI106=3,基本!$E$16*CF106,IF(OR(AI106=1,AI106=2),基本!$E$15*CF106)))","v":""},{"$f":"IF(AJ106=\"\",\"\",IF(AJ106>0,基本!$E$17*CF106))","v":""},{"$f":"IF(ER106=0,\"\",IF(AM106<=4,基本!$E$18*ER106,IF(AM106>4,基本!$E$19*ER106)))","v":""},{"$f":"IF(AC106=\"\",\"\",IF(AC106>=1,基本!$E$20))","v":""},0,"","","","","","","",null,null,null,null,null,null,null,null,null,null,null,null,null,null,null,null,null,null,null,null,null,null,null,null,null,null,null,null,null,null,null,null,null,null,null,null,null,null,null,null,null,null,null,null,null,null,null,null,null,null,null,null,null,"","","","","","","","","","","","","","","","","","","","","","","","","","","","","","","","","","","","","","",null,null,"","","","","","","","","","","","","","","","","","","","","","","","","","","","","",null,null,null,null,null,null,null,null,null,null,null,null,null,null,null,null,null,null,null,null,null,null,null,null,null,null,null,null,null,null,null,null,null,null,null,null,null,null,null,null,null,null,null,null,null,null,null,null,null,null,null,null,null,null,null,null,null,null,null,null,null,null,null,null,null,null,null,null,null,null,null,null,null,null,null,null,null,null,null,null,null,null,null,null,null,null,null,null,null,null,null,null,null,null,null,null,null,null,null,null,null,null,null,null,null,null,null,null,null,null,null,null,null,null,null,null,null,null,null,null,null,null,null,null,null,null,null,null,null,null,null,null,null,null,null,0,0,null,null,null,null,null,null,null,null,null,null,null,null,null,null,null,null,null,null,null,null,null,null,null,null,null,null,null,null,null,null,null,null,null,null,null,null,null,null,null,null,null,null,null,null,null,null,null,null,null,null,null,null,null,null,null,null,null,null,null,null,null,null,null,null,null,null,null,null,null,null,null,null,null,null,null,null,null,null,null,null,null,null,null,null,null,null,null,null,null,null,null,null,null,null,null,null,null,null,null,null,null,null,null,null,null,null,null,null,null,null,null,null,null,null,null,null,null,null,null,null,null,null,null,null,null,null,null,null,null,null,0,0]
[98,null,null,null,null,null,null,null,null,null,null,null,null,null,null,null,null,null,null,null,null,null,null,null,null,null,null,null,null,null,null,null,null,null,null,null,null,null,null,null,null,null,null,null,null,null,null,null,null,null,null,null,null,null,null,null,null,null,null,null,null,null,null,null,null,null,null,null,null,null,null,null,null,null,null,null,null,null,null,null,null,null,null,0,"","","","","","","","","","","","","","","","","","","","","","","","","","","","","","","","","","",null,null,null,null,null,"","","","","","","","",null,null,null,null,null,"","","","","","","","","",null,null,0,{"$f":"IF(Z107<>\"新規\",\"\",IF(AI107=3,基本!$E$14,IF(OR(AI107=1,AI107=2),基本!$E$13,\"\")))","v":""},{"$f":"IF(CF107=0,\"\",IF(AI107=3,基本!$E$16*CF107,IF(OR(AI107=1,AI107=2),基本!$E$15*CF107)))","v":""},{"$f":"IF(AJ107=\"\",\"\",IF(AJ107>0,基本!$E$17*CF107))","v":""},{"$f":"IF(ER107=0,\"\",IF(AM107<=4,基本!$E$18*ER107,IF(AM107>4,基本!$E$19*ER107)))","v":""},{"$f":"IF(AC107=\"\",\"\",IF(AC107>=1,基本!$E$20))","v":""},0,"","","","","","","",null,null,null,null,null,null,null,null,null,null,null,null,null,null,null,null,null,null,null,null,null,null,null,null,null,null,null,null,null,null,null,null,null,null,null,null,null,null,null,null,null,null,null,null,null,null,null,null,null,null,null,null,null,"","","","","","","","","","","","","","","","","","","","","","","","","","","","","","","","","","","","","","",null,null,"","","","","","","","","","","","","","","","","","","","","","","","","","","","","",null,null,null,null,null,null,null,null,null,null,null,null,null,null,null,null,null,null,null,null,null,null,null,null,null,null,null,null,null,null,null,null,null,null,null,null,null,null,null,null,null,null,null,null,null,null,null,null,null,null,null,null,null,null,null,null,null,null,null,null,null,null,null,null,null,null,null,null,null,null,null,null,null,null,null,null,null,null,null,null,null,null,null,null,null,null,null,null,null,null,null,null,null,null,null,null,null,null,null,null,null,null,null,null,null,null,null,null,null,null,null,null,null,null,null,null,null,null,null,null,null,null,null,null,null,null,null,null,null,null,null,null,null,null,null,0,0,null,null,null,null,null,null,null,null,null,null,null,null,null,null,null,null,null,null,null,null,null,null,null,null,null,null,null,null,null,null,null,null,null,null,null,null,null,null,null,null,null,null,null,null,null,null,null,null,null,null,null,null,null,null,null,null,null,null,null,null,null,null,null,null,null,null,null,null,null,null,null,null,null,null,null,null,null,null,null,null,null,null,null,null,null,null,null,null,null,null,null,null,null,null,null,null,null,null,null,null,null,null,null,null,null,null,null,null,null,null,null,null,null,null,null,null,null,null,null,null,null,null,null,null,null,null,null,null,null,null,0,0]
[99,null,null,null,null,null,null,null,null,null,null,null,null,null,null,null,null,null,null,null,null,null,null,null,null,null,null,null,null,null,null,null,null,null,null,null,null,null,null,null,null,null,null,null,null,null,null,null,null,null,null,null,null,null,null,null,null,null,null,null,null,null,null,null,null,null,null,null,null,null,null,null,null,null,null,null,null,null,null,null,null,null,null,0,"","","","","","","","","","","","","","","","","","","","","","","","","","","","","","","","","","",null,null,null,null,null,"","","","","","","","",null,null,null,null,null,"","","","","","","","","",null,null,0,{"$f":"IF(Z108<>\"新規\",\"\",IF(AI108=3,基本!$E$14,IF(OR(AI108=1,AI108=2),基本!$E$13,\"\")))","v":""},{"$f":"IF(CF108=0,\"\",IF(AI108=3,基本!$E$16*CF108,IF(OR(AI108=1,AI108=2),基本!$E$15*CF108)))","v":""},{"$f":"IF(AJ108=\"\",\"\",IF(AJ108>0,基本!$E$17*CF108))","v":""},{"$f":"IF(ER108=0,\"\",IF(AM108<=4,基本!$E$18*ER108,IF(AM108>4,基本!$E$19*ER108)))","v":""},{"$f":"IF(AC108=\"\",\"\",IF(AC108>=1,基本!$E$20))","v":""},0,"","","","","","","",null,null,null,null,null,null,null,null,null,null,null,null,null,null,null,null,null,null,null,null,null,null,null,null,null,null,null,null,null,null,null,null,null,null,null,null,null,null,null,null,null,null,null,null,null,null,null,null,null,null,null,null,null,"","","","","","","","","","","","","","","","","","","","","","","","","","","","","","","","","","","","","","",null,null,"","","","","","","","","","","","","","","","","","","","","","","","","","","","","",null,null,null,null,null,null,null,null,null,null,null,null,null,null,null,null,null,null,null,null,null,null,null,null,null,null,null,null,null,null,null,null,null,null,null,null,null,null,null,null,null,null,null,null,null,null,null,null,null,null,null,null,null,null,null,null,null,null,null,null,null,null,null,null,null,null,null,null,null,null,null,null,null,null,null,null,null,null,null,null,null,null,null,null,null,null,null,null,null,null,null,null,null,null,null,null,null,null,null,null,null,null,null,null,null,null,null,null,null,null,null,null,null,null,null,null,null,null,null,null,null,null,null,null,null,null,null,null,null,null,null,null,null,null,null,0,0,null,null,null,null,null,null,null,null,null,null,null,null,null,null,null,null,null,null,null,null,null,null,null,null,null,null,null,null,null,null,null,null,null,null,null,null,null,null,null,null,null,null,null,null,null,null,null,null,null,null,null,null,null,null,null,null,null,null,null,null,null,null,null,null,null,null,null,null,null,null,null,null,null,null,null,null,null,null,null,null,null,null,null,null,null,null,null,null,null,null,null,null,null,null,null,null,null,null,null,null,null,null,null,null,null,null,null,null,null,null,null,null,null,null,null,null,null,null,null,null,null,null,null,null,null,null,null,null,null,null,0,0]
[100,null,null,null,null,null,null,null,null,null,null,null,null,null,null,null,null,null,null,null,null,null,null,null,null,null,null,null,null,null,null,null,null,null,null,null,null,null,null,null,null,null,null,null,null,null,null,null,null,null,null,null,null,null,null,null,null,null,null,null,null,null,null,null,null,null,null,null,null,null,null,null,null,null,null,null,null,null,null,null,null,null,null,0,"","","","","","","","","","","","","","","","","","","","","","","","","","","","","","","","","","",null,null,null,null,null,"","","","","","","","",null,null,null,null,null,"","","","","","","","","",null,null,0,{"$f":"IF(Z109<>\"新規\",\"\",IF(AI109=3,基本!$E$14,IF(OR(AI109=1,AI109=2),基本!$E$13,\"\")))","v":""},{"$f":"IF(CF109=0,\"\",IF(AI109=3,基本!$E$16*CF109,IF(OR(AI109=1,AI109=2),基本!$E$15*CF109)))","v":""},{"$f":"IF(AJ109=\"\",\"\",IF(AJ109>0,基本!$E$17*CF109))","v":""},{"$f":"IF(ER109=0,\"\",IF(AM109<=4,基本!$E$18*ER109,IF(AM109>4,基本!$E$19*ER109)))","v":""},{"$f":"IF(AC109=\"\",\"\",IF(AC109>=1,基本!$E$20))","v":""},0,"","","","","","","",null,null,null,null,null,null,null,null,null,null,null,null,null,null,null,null,null,null,null,null,null,null,null,null,null,null,null,null,null,null,null,null,null,null,null,null,null,null,null,null,null,null,null,null,null,null,null,null,null,null,null,null,null,"","","","","","","","","","","","","","","","","","","","","","","","","","","","","","","","","","","","","","",null,null,"","","","","","","","","","","","","","","","","","","","","","","","","","","","","",null,null,null,null,null,null,null,null,null,null,null,null,null,null,null,null,null,null,null,null,null,null,null,null,null,null,null,null,null,null,null,null,null,null,null,null,null,null,null,null,null,null,null,null,null,null,null,null,null,null,null,null,null,null,null,null,null,null,null,null,null,null,null,null,null,null,null,null,null,null,null,null,null,null,null,null,null,null,null,null,null,null,null,null,null,null,null,null,null,null,null,null,null,null,null,null,null,null,null,null,null,null,null,null,null,null,null,null,null,null,null,null,null,null,null,null,null,null,null,null,null,null,null,null,null,null,null,null,null,null,null,null,null,null,null,0,0,null,null,null,null,null,null,null,null,null,null,null,null,null,null,null,null,null,null,null,null,null,null,null,null,null,null,null,null,null,null,null,null,null,null,null,null,null,null,null,null,null,null,null,null,null,null,null,null,null,null,null,null,null,null,null,null,null,null,null,null,null,null,null,null,null,null,null,null,null,null,null,null,null,null,null,null,null,null,null,null,null,null,null,null,null,null,null,null,null,null,null,null,null,null,null,null,null,null,null,null,null,null,null,null,null,null,null,null,null,null,null,null,null,null,null,null,null,null,null,null,null,null,null,null,null,null,null,null,null,null,0,0]
[101,null,null,null,null,null,null,null,null,null,null,null,null,null,null,null,null,null,null,null,null,null,null,null,null,null,null,null,null,null,null,null,null,null,null,null,null,null,null,null,null,null,null,null,null,null,null,null,null,null,null,null,null,null,null,null,null,null,null,null,null,null,null,null,null,null,null,null,null,null,null,null,null,null,null,null,null,null,null,null,null,null,null,0,"","","","","","","","","","","","","","","","","","","","","","","","","","","","","","","","","","",null,null,null,null,null,"","","","","","","","",null,null,null,null,null,"","","","","","","","","",null,null,0,{"$f":"IF(Z110<>\"新規\",\"\",IF(AI110=3,基本!$E$14,IF(OR(AI110=1,AI110=2),基本!$E$13,\"\")))","v":""},{"$f":"IF(CF110=0,\"\",IF(AI110=3,基本!$E$16*CF110,IF(OR(AI110=1,AI110=2),基本!$E$15*CF110)))","v":""},{"$f":"IF(AJ110=\"\",\"\",IF(AJ110>0,基本!$E$17*CF110))","v":""},{"$f":"IF(ER110=0,\"\",IF(AM110<=4,基本!$E$18*ER110,IF(AM110>4,基本!$E$19*ER110)))","v":""},{"$f":"IF(AC110=\"\",\"\",IF(AC110>=1,基本!$E$20))","v":""},0,"","","","","","","",null,null,null,null,null,null,null,null,null,null,null,null,null,null,null,null,null,null,null,null,null,null,null,null,null,null,null,null,null,null,null,null,null,null,null,null,null,null,null,null,null,null,null,null,null,null,null,null,null,null,null,null,null,"","","","","","","","","","","","","","","","","","","","","","","","","","","","","","","","","","","","","","",null,null,"","","","","","","","","","","","","","","","","","","","","","","","","","","","","",null,null,null,null,null,null,null,null,null,null,null,null,null,null,null,null,null,null,null,null,null,null,null,null,null,null,null,null,null,null,null,null,null,null,null,null,null,null,null,null,null,null,null,null,null,null,null,null,null,null,null,null,null,null,null,null,null,null,null,null,null,null,null,null,null,null,null,null,null,null,null,null,null,null,null,null,null,null,null,null,null,null,null,null,null,null,null,null,null,null,null,null,null,null,null,null,null,null,null,null,null,null,null,null,null,null,null,null,null,null,null,null,null,null,null,null,null,null,null,null,null,null,null,null,null,null,null,null,null,null,null,null,null,null,null,0,0,null,null,null,null,null,null,null,null,null,null,null,null,null,null,null,null,null,null,null,null,null,null,null,null,null,null,null,null,null,null,null,null,null,null,null,null,null,null,null,null,null,null,null,null,null,null,null,null,null,null,null,null,null,null,null,null,null,null,null,null,null,null,null,null,null,null,null,null,null,null,null,null,null,null,null,null,null,null,null,null,null,null,null,null,null,null,null,null,null,null,null,null,null,null,null,null,null,null,null,null,null,null,null,null,null,null,null,null,null,null,null,null,null,null,null,null,null,null,null,null,null,null,null,null,null,null,null,null,null,null,0,0]
[102,null,null,null,null,null,null,null,null,null,null,null,null,null,null,null,null,null,null,null,null,null,null,null,null,null,null,null,null,null,null,null,null,null,null,null,null,null,null,null,null,null,null,null,null,null,null,null,null,null,null,null,null,null,null,null,null,null,null,null,null,null,null,null,null,null,null,null,null,null,null,null,null,null,null,null,null,null,null,null,null,null,null,0,"","","","","","","","","","","","","","","","","","","","","","","","","","","","","","","","","","",null,null,null,null,null,"","","","","","","","",null,null,null,null,null,"","","","","","","","","",null,null,0,{"$f":"IF(Z111<>\"新規\",\"\",IF(AI111=3,基本!$E$14,IF(OR(AI111=1,AI111=2),基本!$E$13,\"\")))","v":""},{"$f":"IF(CF111=0,\"\",IF(AI111=3,基本!$E$16*CF111,IF(OR(AI111=1,AI111=2),基本!$E$15*CF111)))","v":""},{"$f":"IF(AJ111=\"\",\"\",IF(AJ111>0,基本!$E$17*CF111))","v":""},{"$f":"IF(ER111=0,\"\",IF(AM111<=4,基本!$E$18*ER111,IF(AM111>4,基本!$E$19*ER111)))","v":""},{"$f":"IF(AC111=\"\",\"\",IF(AC111>=1,基本!$E$20))","v":""},0,"","","","","","","",null,null,null,null,null,null,null,null,null,null,null,null,null,null,null,null,null,null,null,null,null,null,null,null,null,null,null,null,null,null,null,null,null,null,null,null,null,null,null,null,null,null,null,null,null,null,null,null,null,null,null,null,null,"","","","","","","","","","","","","","","","","","","","","","","","","","","","","","","","","","","","","","",null,null,"","","","","","","","","","","","","","","","","","","","","","","","","","","","",""]
[103,null,null,null,null,null,null,null,null,null,null,null,null,null,null,null,null,null,null,null,null,null,null,null,null,null,null,null,null,null,null,null,null,null,null,null,null,null,null,null,null,null,null,null,null,null,null,null,null,null,null,null,null,null,null,null,null,null,null,null,null,null,null,null,null,null,null,null,null,null,null,null,null,null,null,null,null,null,null,null,null,null,null,0,"","","","","","","","","","","","","","","","","","","","","","","","","","","","","","","","","","",null,null,null,null,null,"","","","","","","","",null,null,null,null,null,"","","","","","","","","",null,null,0,{"$f":"IF(Z112<>\"新規\",\"\",IF(AI112=3,基本!$E$14,IF(OR(AI112=1,AI112=2),基本!$E$13,\"\")))","v":""},{"$f":"IF(CF112=0,\"\",IF(AI112=3,基本!$E$16*CF112,IF(OR(AI112=1,AI112=2),基本!$E$15*CF112)))","v":""},{"$f":"IF(AJ112=\"\",\"\",IF(AJ112>0,基本!$E$17*CF112))","v":""},{"$f":"IF(ER112=0,\"\",IF(AM112<=4,基本!$E$18*ER112,IF(AM112>4,基本!$E$19*ER112)))","v":""},{"$f":"IF(AC112=\"\",\"\",IF(AC112>=1,基本!$E$20))","v":""},0,"","","","","","","",null,null,null,null,null,null,null,null,null,null,null,null,null,null,null,null,null,null,null,null,null,null,null,null,null,null,null,null,null,null,null,null,null,null,null,null,null,null,null,null,null,null,null,null,null,null,null,null,null,null,null,null,null,"","","","","","","","","","","","","","","","","","","","","","","","","","","","","","","","","","","","","","",null,null,"","","","","","","","","","","","","","","","","","","","","","","","","","","","",""]
[104,null,null,null,null,null,null,null,null,null,null,null,null,null,null,null,null,null,null,null,null,null,null,null,null,null,null,null,null,null,null,null,null,null,null,null,null,null,null,null,null,null,null,null,null,null,null,null,null,null,null,null,null,null,null,null,null,null,null,null,null,null,null,null,null,null,null,null,null,null,null,null,null,null,null,null,null,null,null,null,null,null,null,0,"","","","","","","","","","","","","","","","","","","","","","","","","","","","","","","","","","",null,null,null,null,null,"","","","","","","","",null,null,null,null,null,"","","","","","","","","",null,null,0,{"$f":"IF(Z113<>\"新規\",\"\",IF(AI113=3,基本!$E$14,IF(OR(AI113=1,AI113=2),基本!$E$13,\"\")))","v":""},{"$f":"IF(CF113=0,\"\",IF(AI113=3,基本!$E$16*CF113,IF(OR(AI113=1,AI113=2),基本!$E$15*CF113)))","v":""},{"$f":"IF(AJ113=\"\",\"\",IF(AJ113>0,基本!$E$17*CF113))","v":""},{"$f":"IF(ER113=0,\"\",IF(AM113<=4,基本!$E$18*ER113,IF(AM113>4,基本!$E$19*ER113)))","v":""},{"$f":"IF(AC113=\"\",\"\",IF(AC113>=1,基本!$E$20))","v":""},0,"","","","","","","",null,null,null,null,null,null,null,null,null,null,null,null,null,null,null,null,null,null,null,null,null,null,null,null,null,null,null,null,null,null,null,null,null,null,null,null,null,null,null,null,null,null,null,null,null,null,null,null,null,null,null,null,null,"","","","","","","","","","","","","","","","","","","","","","","","","","","","","","","","","","","","","","",null,null,"","","","","","","","","","","","","","","","","","","","","","","","","","","","",""]
[105,null,null,null,null,null,null,null,null,null,null,null,null,null,null,null,null,null,null,null,null,null,null,null,null,null,null,null,null,null,null,null,null,null,null,null,null,null,null,null,null,null,null,null,null,null,null,null,null,null,null,null,null,null,null,null,null,null,null,null,null,null,null,null,null,null,null,null,null,null,null,null,null,null,null,null,null,null,null,null,null,null,null,0,"","","","","","","","","","","","","","","","","","","","","","","","","","","","","","","","","","",null,null,null,null,null,"","","","","","","","",null,null,null,null,null,"","","","","","","","","",null,null,0,{"$f":"IF(Z114<>\"新規\",\"\",IF(AI114=3,基本!$E$14,IF(OR(AI114=1,AI114=2),基本!$E$13,\"\")))","v":""},{"$f":"IF(CF114=0,\"\",IF(AI114=3,基本!$E$16*CF114,IF(OR(AI114=1,AI114=2),基本!$E$15*CF114)))","v":""},{"$f":"IF(AJ114=\"\",\"\",IF(AJ114>0,基本!$E$17*CF114))","v":""},{"$f":"IF(ER114=0,\"\",IF(AM114<=4,基本!$E$18*ER114,IF(AM114>4,基本!$E$19*ER114)))","v":""},{"$f":"IF(AC114=\"\",\"\",IF(AC114>=1,基本!$E$20))","v":""},0,"","","","","","","",null,null,null,null,null,null,null,null,null,null,null,null,null,null,null,null,null,null,null,null,null,null,null,null,null,null,null,null,null,null,null,null,null,null,null,null,null,null,null,null,null,null,null,null,null,null,null,null,null,null,null,null,null,"","","","","","","","","","","","","","","","","","","","","","","","","","","","","","","","","","","","","","",null,null,"","","","","","","","","","","","","","","","","","","","","","","","","","","","",""]
[106,null,null,null,null,null,null,null,null,null,null,null,null,null,null,null,null,null,null,null,null,null,null,null,null,null,null,null,null,null,null,null,null,null,null,null,null,null,null,null,null,null,null,null,null,null,null,null,null,null,null,null,null,null,null,null,null,null,null,null,null,null,null,null,null,null,null,null,null,null,null,null,null,null,null,null,null,null,null,null,null,null,null,0,"","","","","","","","","","","","","","","","","","","","","","","","","","","","","","","","","","",null,null,null,null,null,"","","","","","","","",null,null,null,null,null,"","","","","","","","","",null,null,0,{"$f":"IF(Z115<>\"新規\",\"\",IF(AI115=3,基本!$E$14,IF(OR(AI115=1,AI115=2),基本!$E$13,\"\")))","v":""},{"$f":"IF(CF115=0,\"\",IF(AI115=3,基本!$E$16*CF115,IF(OR(AI115=1,AI115=2),基本!$E$15*CF115)))","v":""},{"$f":"IF(AJ115=\"\",\"\",IF(AJ115>0,基本!$E$17*CF115))","v":""},{"$f":"IF(ER115=0,\"\",IF(AM115<=4,基本!$E$18*ER115,IF(AM115>4,基本!$E$19*ER115)))","v":""},{"$f":"IF(AC115=\"\",\"\",IF(AC115>=1,基本!$E$20))","v":""},0,"","","","","","","",null,null,null,null,null,null,null,null,null,null,null,null,null,null,null,null,null,null,null,null,null,null,null,null,null,null,null,null,null,null,null,null,null,null,null,null,null,null,null,null,null,null,null,null,null,null,null,null,null,null,null,null,null,"","","","","","","","","","","","","","","","","","","","","","","","","","","","","","","","","","","","","","",null,null,"","","","","","","","","","","","","","","","","","","","","","","","","","","","",""]
[107,null,null,null,null,null,null,null,null,null,null,null,null,null,null,null,null,null,null,null,null,null,null,null,null,null,null,null,null,null,null,null,null,null,null,null,null,null,null,null,null,null,null,null,null,null,null,null,null,null,null,null,null,null,null,null,null,null,null,null,null,null,null,null,null,null,null,null,null,null,null,null,null,null,null,null,null,null,null,null,null,null,null,0,"","","","","","","","","","","","","","","","","","","","","","","","","","","","","","","","","","",null,null,null,null,null,"","","","","","","","",null,null,null,null,null,"","","","","","","","","",null,null,0,{"$f":"IF(Z116<>\"新規\",\"\",IF(AI116=3,基本!$E$14,IF(OR(AI116=1,AI116=2),基本!$E$13,\"\")))","v":""},{"$f":"IF(CF116=0,\"\",IF(AI116=3,基本!$E$16*CF116,IF(OR(AI116=1,AI116=2),基本!$E$15*CF116)))","v":""},{"$f":"IF(AJ116=\"\",\"\",IF(AJ116>0,基本!$E$17*CF116))","v":""},{"$f":"IF(ER116=0,\"\",IF(AM116<=4,基本!$E$18*ER116,IF(AM116>4,基本!$E$19*ER116)))","v":""},{"$f":"IF(AC116=\"\",\"\",IF(AC116>=1,基本!$E$20))","v":""},0,"","","","","","","",null,null,null,null,null,null,null,null,null,null,null,null,null,null,null,null,null,null,null,null,null,null,null,null,null,null,null,null,null,null,null,null,null,null,null,null,null,null,null,null,null,null,null,null,null,null,null,null,null,null,null,null,null,"","","","","","","","","","","","","","","","","","","","","","","","","","","","","","","","","","","","","","",null,null,"","","","","","","","","","","","","","","","","","","","","","","","","","","","",""]
[108,null,null,null,null,null,null,null,null,null,null,null,null,null,null,null,null,null,null,null,null,null,null,null,null,null,null,null,null,null,null,null,null,null,null,null,null,null,null,null,null,null,null,null,null,null,null,null,null,null,null,null,null,null,null,null,null,null,null,null,null,null,null,null,null,null,null,null,null,null,null,null,null,null,null,null,null,null,null,null,null,null,null,0,"","","","","","","","","","","","","","","","","","","","","","","","","","","","","","","","","","",null,null,null,null,null,"","","","","","","","",null,null,null,null,null,"","","","","","","","","",null,null,0,{"$f":"IF(Z117<>\"新規\",\"\",IF(AI117=3,基本!$E$14,IF(OR(AI117=1,AI117=2),基本!$E$13,\"\")))","v":""},{"$f":"IF(CF117=0,\"\",IF(AI117=3,基本!$E$16*CF117,IF(OR(AI117=1,AI117=2),基本!$E$15*CF117)))","v":""},{"$f":"IF(AJ117=\"\",\"\",IF(AJ117>0,基本!$E$17*CF117))","v":""},{"$f":"IF(ER117=0,\"\",IF(AM117<=4,基本!$E$18*ER117,IF(AM117>4,基本!$E$19*ER117)))","v":""},{"$f":"IF(AC117=\"\",\"\",IF(AC117>=1,基本!$E$20))","v":""},0,"","","","","","","",null,null,null,null,null,null,null,null,null,null,null,null,null,null,null,null,null,null,null,null,null,null,null,null,null,null,null,null,null,null,null,null,null,null,null,null,null,null,null,null,null,null,null,null,null,null,null,null,null,null,null,null,null,"","","","","","","","","","","","","","","","","","","","","","","","","","","","","","","","","","","","","","",null,null,"","","","","","","","","","","","","","","","","","","","","","","","","","","","",""]
[109,null,null,null,null,null,null,null,null,null,null,null,null,null,null,null,null,null,null,null,null,null,null,null,null,null,null,null,null,null,null,null,null,null,null,null,null,null,null,null,null,null,null,null,null,null,null,null,null,null,null,null,null,null,null,null,null,null,null,null,null,null,null,null,null,null,null,null,null,null,null,null,null,null,null,null,null,null,null,null,null,null,null,0,"","","","","","","","","","","","","","","","","","","","","","","","","","","","","","","","","","",null,null,null,null,null,"","","","","","","","",null,null,null,null,null,"","","","","","","","","",null,null,0,{"$f":"IF(Z118<>\"新規\",\"\",IF(AI118=3,基本!$E$14,IF(OR(AI118=1,AI118=2),基本!$E$13,\"\")))","v":""},{"$f":"IF(CF118=0,\"\",IF(AI118=3,基本!$E$16*CF118,IF(OR(AI118=1,AI118=2),基本!$E$15*CF118)))","v":""},{"$f":"IF(AJ118=\"\",\"\",IF(AJ118>0,基本!$E$17*CF118))","v":""},{"$f":"IF(ER118=0,\"\",IF(AM118<=4,基本!$E$18*ER118,IF(AM118>4,基本!$E$19*ER118)))","v":""},{"$f":"IF(AC118=\"\",\"\",IF(AC118>=1,基本!$E$20))","v":""},0,"","","","","","","",null,null,null,null,null,null,null,null,null,null,null,null,null,null,null,null,null,null,null,null,null,null,null,null,null,null,null,null,null,null,null,null,null,null,null,null,null,null,null,null,null,null,null,null,null,null,null,null,null,null,null,null,null,"","","","","","","","","","","","","","","","","","","","","","","","","","","","","","","","","","","","","","",null,null,"","","","","","","","","","","","","","","","","","","","","","","","","","","","",""]
[110,null,null,null,null,null,null,null,null,null,null,null,null,null,null,null,null,null,null,null,null,null,null,null,null,null,null,null,null,null,null,null,null,null,null,null,null,null,null,null,null,null,null,null,null,null,null,null,null,null,null,null,null,null,null,null,null,null,null,null,null,null,null,null,null,null,null,null,null,null,null,null,null,null,null,null,null,null,null,null,null,null,null,0,"","","","","","","","","","","","","","","","","","","","","","","","","","","","","","","","","","",null,null,null,null,null,"","","","","","","","",null,null,null,null,null,"","","","","","","","","",null,null,0,{"$f":"IF(Z119<>\"新規\",\"\",IF(AI119=3,基本!$E$14,IF(OR(AI119=1,AI119=2),基本!$E$13,\"\")))","v":""},{"$f":"IF(CF119=0,\"\",IF(AI119=3,基本!$E$16*CF119,IF(OR(AI119=1,AI119=2),基本!$E$15*CF119)))","v":""},{"$f":"IF(AJ119=\"\",\"\",IF(AJ119>0,基本!$E$17*CF119))","v":""},{"$f":"IF(ER119=0,\"\",IF(AM119<=4,基本!$E$18*ER119,IF(AM119>4,基本!$E$19*ER119)))","v":""},{"$f":"IF(AC119=\"\",\"\",IF(AC119>=1,基本!$E$20))","v":""},0,"","","","","","","",null,null,null,null,null,null,null,null,null,null,null,null,null,null,null,null,null,null,null,null,null,null,null,null,null,null,null,null,null,null,null,null,null,null,null,null,null,null,null,null,null,null,null,null,null,null,null,null,null,null,null,null,null,"","","","","","","","","","","","","","","","","","","","","","","","","","","","","","","","","","","","","","",null,null,"","","","","","","","","","","","","","","","","","","","","","","","","","","","",""]
[111,null,null,null,null,null,null,null,null,null,null,null,null,null,null,null,null,null,null,null,null,null,null,null,null,null,null,null,null,null,null,null,null,null,null,null,null,null,null,null,null,null,null,null,null,null,null,null,null,null,null,null,null,null,null,null,null,null,null,null,null,null,null,null,null,null,null,null,null,null,null,null,null,null,null,null,null,null,null,null,null,null,null,0,"","","","","","","","","","","","","","","","","","","","","","","","","","","","","","","","","","",null,null,null,null,null,"","","","","","","","",null,null,null,null,null,"","","","","","","","","",null,null,0,{"$f":"IF(Z120<>\"新規\",\"\",IF(AI120=3,基本!$E$14,IF(OR(AI120=1,AI120=2),基本!$E$13,\"\")))","v":""},{"$f":"IF(CF120=0,\"\",IF(AI120=3,基本!$E$16*CF120,IF(OR(AI120=1,AI120=2),基本!$E$15*CF120)))","v":""},{"$f":"IF(AJ120=\"\",\"\",IF(AJ120>0,基本!$E$17*CF120))","v":""},{"$f":"IF(ER120=0,\"\",IF(AM120<=4,基本!$E$18*ER120,IF(AM120>4,基本!$E$19*ER120)))","v":""},{"$f":"IF(AC120=\"\",\"\",IF(AC120>=1,基本!$E$20))","v":""},0,"","","","","","","",null,null,null,null,null,null,null,null,null,null,null,null,null,null,null,null,null,null,null,null,null,null,null,null,null,null,null,null,null,null,null,null,null,null,null,null,null,null,null,null,null,null,null,null,null,null,null,null,null,null,null,null,null,"","","","","","","","","","","","","","","","","","","","","","","","","","","","","","","","","","","","","","",null,null,"","","","","","","","","","","","","","","","","","","","","","","","","","","","",""]
[112,null,null,null,null,null,null,null,null,null,null,null,null,null,null,null,null,null,null,null,null,null,null,null,null,null,null,null,null,null,null,null,null,null,null,null,null,null,null,null,null,null,null,null,null,null,null,null,null,null,null,null,null,null,null,null,null,null,null,null,null,null,null,null,null,null,null,null,null,null,null,null,null,null,null,null,null,null,null,null,null,null,null,0,"","","","","","","","","","","","","","","","","","","","","","","","","","","","","","","","","","",null,null,null,null,null,"","","","","","","","",null,null,null,null,null,"","","","","","","","","",null,null,0,{"$f":"IF(Z121<>\"新規\",\"\",IF(AI121=3,基本!$E$14,IF(OR(AI121=1,AI121=2),基本!$E$13,\"\")))","v":""},{"$f":"IF(CF121=0,\"\",IF(AI121=3,基本!$E$16*CF121,IF(OR(AI121=1,AI121=2),基本!$E$15*CF121)))","v":""},{"$f":"IF(AJ121=\"\",\"\",IF(AJ121>0,基本!$E$17*CF121))","v":""},{"$f":"IF(ER121=0,\"\",IF(AM121<=4,基本!$E$18*ER121,IF(AM121>4,基本!$E$19*ER121)))","v":""},{"$f":"IF(AC121=\"\",\"\",IF(AC121>=1,基本!$E$20))","v":""},0,"","","","","","","",null,null,null,null,null,null,null,null,null,null,null,null,null,null,null,null,null,null,null,null,null,null,null,null,null,null,null,null,null,null,null,null,null,null,null,null,null,null,null,null,null,null,null,null,null,null,null,null,null,null,null,null,null,"","","","","","","","","","","","","","","","","","","","","","","","","","","","","","","","","","","","","","",null,null,"","","","","","","","","","","","","","","","","","","","","","","","","","","","",""]
[113,null,null,null,null,null,null,null,null,null,null,null,null,null,null,null,null,null,null,null,null,null,null,null,null,null,null,null,null,null,null,null,null,null,null,null,null,null,null,null,null,null,null,null,null,null,null,null,null,null,null,null,null,null,null,null,null,null,null,null,null,null,null,null,null,null,null,null,null,null,null,null,null,null,null,null,null,null,null,null,null,null,null,0,"","","","","","","","","","","","","","","","","","","","","","","","","","","","","","","","","","",null,null,null,null,null,"","","","","","","","",null,null,null,null,null,"","","","","","","","","",null,null,0,{"$f":"IF(Z122<>\"新規\",\"\",IF(AI122=3,基本!$E$14,IF(OR(AI122=1,AI122=2),基本!$E$13,\"\")))","v":""},{"$f":"IF(CF122=0,\"\",IF(AI122=3,基本!$E$16*CF122,IF(OR(AI122=1,AI122=2),基本!$E$15*CF122)))","v":""},{"$f":"IF(AJ122=\"\",\"\",IF(AJ122>0,基本!$E$17*CF122))","v":""},{"$f":"IF(ER122=0,\"\",IF(AM122<=4,基本!$E$18*ER122,IF(AM122>4,基本!$E$19*ER122)))","v":""},{"$f":"IF(AC122=\"\",\"\",IF(AC122>=1,基本!$E$20))","v":""},0,"","","","","","","",null,null,null,null,null,null,null,null,null,null,null,null,null,null,null,null,null,null,null,null,null,null,null,null,null,null,null,null,null,null,null,null,null,null,null,null,null,null,null,null,null,null,null,null,null,null,null,null,null,null,null,null,null,"","","","","","","","","","","","","","","","","","","","","","","","","","","","","","","","","","","","","","",null,null,"","","","","","","","","","","","","","","","","","","","","","","","","","","","",""]
[114,null,null,null,null,null,null,null,null,null,null,null,null,null,null,null,null,null,null,null,null,null,null,null,null,null,null,null,null,null,null,null,null,null,null,null,null,null,null,null,null,null,null,null,null,null,null,null,null,null,null,null,null,null,null,null,null,null,null,null,null,null,null,null,null,null,null,null,null,null,null,null,null,null,null,null,null,null,null,null,null,null,null,0,"","","","","","","","","","","","","","","","","","","","","","","","","","","","","","","","","","",null,null,null,null,null,"","","","","","","","",null,null,null,null,null,"","","","","","","","","",null,null,0,{"$f":"IF(Z123<>\"新規\",\"\",IF(AI123=3,基本!$E$14,IF(OR(AI123=1,AI123=2),基本!$E$13,\"\")))","v":""},{"$f":"IF(CF123=0,\"\",IF(AI123=3,基本!$E$16*CF123,IF(OR(AI123=1,AI123=2),基本!$E$15*CF123)))","v":""},{"$f":"IF(AJ123=\"\",\"\",IF(AJ123>0,基本!$E$17*CF123))","v":""},{"$f":"IF(ER123=0,\"\",IF(AM123<=4,基本!$E$18*ER123,IF(AM123>4,基本!$E$19*ER123)))","v":""},{"$f":"IF(AC123=\"\",\"\",IF(AC123>=1,基本!$E$20))","v":""},0,"","","","","","","",null,null,null,null,null,null,null,null,null,null,null,null,null,null,null,null,null,null,null,null,null,null,null,null,null,null,null,null,null,null,null,null,null,null,null,null,null,null,null,null,null,null,null,null,null,null,null,null,null,null,null,null,null,"","","","","","","","","","","","","","","","","","","","","","","","","","","","","","","","","","","","","","",null,null,"","","","","","","","","","","","","","","","","","","","","","","","","","","","",""]
[115,null,null,null,null,null,null,null,null,null,null,null,null,null,null,null,null,null,null,null,null,null,null,null,null,null,null,null,null,null,null,null,null,null,null,null,null,null,null,null,null,null,null,null,null,null,null,null,null,null,null,null,null,null,null,null,null,null,null,null,null,null,null,null,null,null,null,null,null,null,null,null,null,null,null,null,null,null,null,null,null,null,null,0,"","","","","","","","","","","","","","","","","","","","","","","","","","","","","","","","","","",null,null,null,null,null,"","","","","","","","",null,null,null,null,null,"","","","","","","","","",null,null,0,{"$f":"IF(Z124<>\"新規\",\"\",IF(AI124=3,基本!$E$14,IF(OR(AI124=1,AI124=2),基本!$E$13,\"\")))","v":""},{"$f":"IF(CF124=0,\"\",IF(AI124=3,基本!$E$16*CF124,IF(OR(AI124=1,AI124=2),基本!$E$15*CF124)))","v":""},{"$f":"IF(AJ124=\"\",\"\",IF(AJ124>0,基本!$E$17*CF124))","v":""},{"$f":"IF(ER124=0,\"\",IF(AM124<=4,基本!$E$18*ER124,IF(AM124>4,基本!$E$19*ER124)))","v":""},{"$f":"IF(AC124=\"\",\"\",IF(AC124>=1,基本!$E$20))","v":""},0,"","","","","","","",null,null,null,null,null,null,null,null,null,null,null,null,null,null,null,null,null,null,null,null,null,null,null,null,null,null,null,null,null,null,null,null,null,null,null,null,null,null,null,null,null,null,null,null,null,null,null,null,null,null,null,null,null,"","","","","","","","","","","","","","","","","","","","","","","","","","","","","","","","","","","","","","",null,null,"","","","","","","","","","","","","","","","","","","","","","","","","","","","",""]
[116,null,null,null,null,null,null,null,null,null,null,null,null,null,null,null,null,null,null,null,null,null,null,null,null,null,null,null,null,null,null,null,null,null,null,null,null,null,null,null,null,null,null,null,null,null,null,null,null,null,null,null,null,null,null,null,null,null,null,null,null,null,null,null,null,null,null,null,null,null,null,null,null,null,null,null,null,null,null,null,null,null,null,0,"","","","","","","","","","","","","","","","","","","","","","","","","","","","","","","","","","",null,null,null,null,null,"","","","","","","","",null,null,null,null,null,"","","","","","","","","",null,null,0,{"$f":"IF(Z125<>\"新規\",\"\",IF(AI125=3,基本!$E$14,IF(OR(AI125=1,AI125=2),基本!$E$13,\"\")))","v":""},{"$f":"IF(CF125=0,\"\",IF(AI125=3,基本!$E$16*CF125,IF(OR(AI125=1,AI125=2),基本!$E$15*CF125)))","v":""},{"$f":"IF(AJ125=\"\",\"\",IF(AJ125>0,基本!$E$17*CF125))","v":""},{"$f":"IF(ER125=0,\"\",IF(AM125<=4,基本!$E$18*ER125,IF(AM125>4,基本!$E$19*ER125)))","v":""},{"$f":"IF(AC125=\"\",\"\",IF(AC125>=1,基本!$E$20))","v":""},0,"","","","","","","",null,null,null,null,null,null,null,null,null,null,null,null,null,null,null,null,null,null,null,null,null,null,null,null,null,null,null,null,null,null,null,null,null,null,null,null,null,null,null,null,null,null,null,null,null,null,null,null,null,null,null,null,null,"","","","","","","","","","","","","","","","","","","","","","","","","","","","","","","","","","","","","","",null,null,"","","","","","","","","","","","","","","","","","","","","","","","","","","","",""]
[117,null,null,null,null,null,null,null,null,null,null,null,null,null,null,null,null,null,null,null,null,null,null,null,null,null,null,null,null,null,null,null,null,null,null,null,null,null,null,null,null,null,null,null,null,null,null,null,null,null,null,null,null,null,null,null,null,null,null,null,null,null,null,null,null,null,null,null,null,null,null,null,null,null,null,null,null,null,null,null,null,null,null,0,"","","","","","","","","","","","","","","","","","","","","","","","","","","","","","","","","","",null,null,null,null,null,"","","","","","","","",null,null,null,null,null,"","","","","","","","","",null,null,0,{"$f":"IF(Z126<>\"新規\",\"\",IF(AI126=3,基本!$E$14,IF(OR(AI126=1,AI126=2),基本!$E$13,\"\")))","v":""},{"$f":"IF(CF126=0,\"\",IF(AI126=3,基本!$E$16*CF126,IF(OR(AI126=1,AI126=2),基本!$E$15*CF126)))","v":""},{"$f":"IF(AJ126=\"\",\"\",IF(AJ126>0,基本!$E$17*CF126))","v":""},{"$f":"IF(ER126=0,\"\",IF(AM126<=4,基本!$E$18*ER126,IF(AM126>4,基本!$E$19*ER126)))","v":""},{"$f":"IF(AC126=\"\",\"\",IF(AC126>=1,基本!$E$20))","v":""},0,"","","","","","","",null,null,null,null,null,null,null,null,null,null,null,null,null,null,null,null,null,null,null,null,null,null,null,null,null,null,null,null,null,null,null,null,null,null,null,null,null,null,null,null,null,null,null,null,null,null,null,null,null,null,null,null,null,"","","","","","","","","","","","","","","","","","","","","","","","","","","","","","","","","","","","","","",null,null,"","","","","","","","","","","","","","","","","","","","","","","","","","","","",""]
[118,null,null,null,null,null,null,null,null,null,null,null,null,null,null,null,null,null,null,null,null,null,null,null,null,null,null,null,null,null,null,null,null,null,null,null,null,null,null,null,null,null,null,null,null,null,null,null,null,null,null,null,null,null,null,null,null,null,null,null,null,null,null,null,null,null,null,null,null,null,null,null,null,null,null,null,null,null,null,null,null,null,null,0,"","","","","","","","","","","","","","","","","","","","","","","","","","","","","","","","","","",null,null,null,null,null,"","","","","","","","",null,null,null,null,null,"","","","","","","","","",null,null,0,{"$f":"IF(Z127<>\"新規\",\"\",IF(AI127=3,基本!$E$14,IF(OR(AI127=1,AI127=2),基本!$E$13,\"\")))","v":""},{"$f":"IF(CF127=0,\"\",IF(AI127=3,基本!$E$16*CF127,IF(OR(AI127=1,AI127=2),基本!$E$15*CF127)))","v":""},{"$f":"IF(AJ127=\"\",\"\",IF(AJ127>0,基本!$E$17*CF127))","v":""},{"$f":"IF(ER127=0,\"\",IF(AM127<=4,基本!$E$18*ER127,IF(AM127>4,基本!$E$19*ER127)))","v":""},{"$f":"IF(AC127=\"\",\"\",IF(AC127>=1,基本!$E$20))","v":""},0,"","","","","","","",null,null,null,null,null,null,null,null,null,null,null,null,null,null,null,null,null,null,null,null,null,null,null,null,null,null,null,null,null,null,null,null,null,null,null,null,null,null,null,null,null,null,null,null,null,null,null,null,null,null,null,null,null,"","","","","","","","","","","","","","","","","","","","","","","","","","","","","","","","","","","","","","",null,null,"","","","","","","","","","","","","","","","","","","","","","","","","","","","",""]
[119,null,null,null,null,null,null,null,null,null,null,null,null,null,null,null,null,null,null,null,null,null,null,null,null,null,null,null,null,null,null,null,null,null,null,null,null,null,null,null,null,null,null,null,null,null,null,null,null,null,null,null,null,null,null,null,null,null,null,null,null,null,null,null,null,null,null,null,null,null,null,null,null,null,null,null,null,null,null,null,null,null,null,0,"","","","","","","","","","","","","","","","","","","","","","","","","","","","","","","","","","",null,null,null,null,null,"","","","","","","","",null,null,null,null,null,"","","","","","","","","",null,null,0,{"$f":"IF(Z128<>\"新規\",\"\",IF(AI128=3,基本!$E$14,IF(OR(AI128=1,AI128=2),基本!$E$13,\"\")))","v":""},{"$f":"IF(CF128=0,\"\",IF(AI128=3,基本!$E$16*CF128,IF(OR(AI128=1,AI128=2),基本!$E$15*CF128)))","v":""},{"$f":"IF(AJ128=\"\",\"\",IF(AJ128>0,基本!$E$17*CF128))","v":""},{"$f":"IF(ER128=0,\"\",IF(AM128<=4,基本!$E$18*ER128,IF(AM128>4,基本!$E$19*ER128)))","v":""},{"$f":"IF(AC128=\"\",\"\",IF(AC128>=1,基本!$E$20))","v":""},0,"","","","","","","",null,null,null,null,null,null,null,null,null,null,null,null,null,null,null,null,null,null,null,null,null,null,null,null,null,null,null,null,null,null,null,null,null,null,null,null,null,null,null,null,null,null,null,null,null,null,null,null,null,null,null,null,null,"","","","","","","","","","","","","","","","","","","","","","","","","","","","","","","","","","","","","","",null,null,"","","","","","","","","","","","","","","","","","","","","","","","","","","","",""]
[120,null,null,null,null,null,null,null,null,null,null,null,null,null,null,null,null,null,null,null,null,null,null,null,null,null,null,null,null,null,null,null,null,null,null,null,null,null,null,null,null,null,null,null,null,null,null,null,null,null,null,null,null,null,null,null,null,null,null,null,null,null,null,null,null,null,null,null,null,null,null,null,null,null,null,null,null,null,null,null,null,null,null,0,"","","","","","","","","","","","","","","","","","","","","","","","","","","","","","","","","","",null,null,null,null,null,"","","","","","","","",null,null,null,null,null,"","","","","","","","","",null,null,0,{"$f":"IF(Z129<>\"新規\",\"\",IF(AI129=3,基本!$E$14,IF(OR(AI129=1,AI129=2),基本!$E$13,\"\")))","v":""},{"$f":"IF(CF129=0,\"\",IF(AI129=3,基本!$E$16*CF129,IF(OR(AI129=1,AI129=2),基本!$E$15*CF129)))","v":""},{"$f":"IF(AJ129=\"\",\"\",IF(AJ129>0,基本!$E$17*CF129))","v":""},{"$f":"IF(ER129=0,\"\",IF(AM129<=4,基本!$E$18*ER129,IF(AM129>4,基本!$E$19*ER129)))","v":""},{"$f":"IF(AC129=\"\",\"\",IF(AC129>=1,基本!$E$20))","v":""},0,"","","","","","","",null,null,null,null,null,null,null,null,null,null,null,null,null,null,null,null,null,null,null,null,null,null,null,null,null,null,null,null,null,null,null,null,null,null,null,null,null,null,null,null,null,null,null,null,null,null,null,null,null,null,null,null,null,"","","","","","","","","","","","","","","","","","","","","","","","","","","","","","","","","","","","","","",null,null,"","","","","","","","","","","","","","","","","","","","","","","","","","","","",""]
[121,null,null,null,null,null,null,null,null,null,null,null,null,null,null,null,null,null,null,null,null,null,null,null,null,null,null,null,null,null,null,null,null,null,null,null,null,null,null,null,null,null,null,null,null,null,null,null,null,null,null,null,null,null,null,null,null,null,null,null,null,null,null,null,null,null,null,null,null,null,null,null,null,null,null,null,null,null,null,null,null,null,null,0,"","","","","","","","","","","","","","","","","","","","","","","","","","","","","","","","","","",null,null,null,null,null,"","","","","","","","",null,null,null,null,null,"","","","","","","","","",null,null,0,{"$f":"IF(Z130<>\"新規\",\"\",IF(AI130=3,基本!$E$14,IF(OR(AI130=1,AI130=2),基本!$E$13,\"\")))","v":""},{"$f":"IF(CF130=0,\"\",IF(AI130=3,基本!$E$16*CF130,IF(OR(AI130=1,AI130=2),基本!$E$15*CF130)))","v":""},{"$f":"IF(AJ130=\"\",\"\",IF(AJ130>0,基本!$E$17*CF130))","v":""},{"$f":"IF(ER130=0,\"\",IF(AM130<=4,基本!$E$18*ER130,IF(AM130>4,基本!$E$19*ER130)))","v":""},{"$f":"IF(AC130=\"\",\"\",IF(AC130>=1,基本!$E$20))","v":""},0,"","","","","","","",null,null,null,null,null,null,null,null,null,null,null,null,null,null,null,null,null,null,null,null,null,null,null,null,null,null,null,null,null,null,null,null,null,null,null,null,null,null,null,null,null,null,null,null,null,null,null,null,null,null,null,null,null,"","","","","","","","","","","","","","","","","","","","","","","","","","","","","","","","","","","","","","",null,null,"","","","","","","","","","","","","","","","","","","","","","","","","","","","",""]
[122,null,null,null,null,null,null,null,null,null,null,null,null,null,null,null,null,null,null,null,null,null,null,null,null,null,null,null,null,null,null,null,null,null,null,null,null,null,null,null,null,null,null,null,null,null,null,null,null,null,null,null,null,null,null,null,null,null,null,null,null,null,null,null,null,null,null,null,null,null,null,null,null,null,null,null,null,null,null,null,null,null,null,0,"","","","","","","","","","","","","","","","","","","","","","","","","","","","","","","","","","",null,null,null,null,null,"","","","","","","","",null,null,null,null,null,"","","","","","","","","",null,null,0,{"$f":"IF(Z131<>\"新規\",\"\",IF(AI131=3,基本!$E$14,IF(OR(AI131=1,AI131=2),基本!$E$13,\"\")))","v":""},{"$f":"IF(CF131=0,\"\",IF(AI131=3,基本!$E$16*CF131,IF(OR(AI131=1,AI131=2),基本!$E$15*CF131)))","v":""},{"$f":"IF(AJ131=\"\",\"\",IF(AJ131>0,基本!$E$17*CF131))","v":""},{"$f":"IF(ER131=0,\"\",IF(AM131<=4,基本!$E$18*ER131,IF(AM131>4,基本!$E$19*ER131)))","v":""},{"$f":"IF(AC131=\"\",\"\",IF(AC131>=1,基本!$E$20))","v":""},0,"","","","","","","",null,null,null,null,null,null,null,null,null,null,null,null,null,null,null,null,null,null,null,null,null,null,null,null,null,null,null,null,null,null,null,null,null,null,null,null,null,null,null,null,null,null,null,null,null,null,null,null,null,null,null,null,null,"","","","","","","","","","","","","","","","","","","","","","","","","","","","","","","","","","","","","","",null,null,"","","","","","","","","","","","","","","","","","","","","","","","","","","","",""]
[123,null,null,null,null,null,null,null,null,null,null,null,null,null,null,null,null,null,null,null,null,null,null,null,null,null,null,null,null,null,null,null,null,null,null,null,null,null,null,null,null,null,null,null,null,null,null,null,null,null,null,null,null,null,null,null,null,null,null,null,null,null,null,null,null,null,null,null,null,null,null,null,null,null,null,null,null,null,null,null,null,null,null,0,"","","","","","","","","","","","","","","","","","","","","","","","","","","","","","","","","","",null,null,null,null,null,"","","","","","","","",null,null,null,null,null,"","","","","","","","","",null,null,0,{"$f":"IF(Z132<>\"新規\",\"\",IF(AI132=3,基本!$E$14,IF(OR(AI132=1,AI132=2),基本!$E$13,\"\")))","v":""},{"$f":"IF(CF132=0,\"\",IF(AI132=3,基本!$E$16*CF132,IF(OR(AI132=1,AI132=2),基本!$E$15*CF132)))","v":""},{"$f":"IF(AJ132=\"\",\"\",IF(AJ132>0,基本!$E$17*CF132))","v":""},{"$f":"IF(ER132=0,\"\",IF(AM132<=4,基本!$E$18*ER132,IF(AM132>4,基本!$E$19*ER132)))","v":""},{"$f":"IF(AC132=\"\",\"\",IF(AC132>=1,基本!$E$20))","v":""},0,"","","","","","","",null,null,null,null,null,null,null,null,null,null,null,null,null,null,null,null,null,null,null,null,null,null,null,null,null,null,null,null,null,null,null,null,null,null,null,null,null,null,null,null,null,null,null,null,null,null,null,null,null,null,null,null,null,"","","","","","","","","","","","","","","","","","","","","","","","","","","","","","","","","","","","","","",null,null,"","","","","","","","","","","","","","","","","","","","","","","","","","","","",""]
[124,null,null,null,null,null,null,null,null,null,null,null,null,null,null,null,null,null,null,null,null,null,null,null,null,null,null,null,null,null,null,null,null,null,null,null,null,null,null,null,null,null,null,null,null,null,null,null,null,null,null,null,null,null,null,null,null,null,null,null,null,null,null,null,null,null,null,null,null,null,null,null,null,null,null,null,null,null,null,null,null,null,null,0,"","","","","","","","","","","","","","","","","","","","","","","","","","","","","","","","","","",null,null,null,null,null,"","","","","","","","",null,null,null,null,null,"","","","","","","","","",null,null,0,{"$f":"IF(Z133<>\"新規\",\"\",IF(AI133=3,基本!$E$14,IF(OR(AI133=1,AI133=2),基本!$E$13,\"\")))","v":""},{"$f":"IF(CF133=0,\"\",IF(AI133=3,基本!$E$16*CF133,IF(OR(AI133=1,AI133=2),基本!$E$15*CF133)))","v":""},{"$f":"IF(AJ133=\"\",\"\",IF(AJ133>0,基本!$E$17*CF133))","v":""},{"$f":"IF(ER133=0,\"\",IF(AM133<=4,基本!$E$18*ER133,IF(AM133>4,基本!$E$19*ER133)))","v":""},{"$f":"IF(AC133=\"\",\"\",IF(AC133>=1,基本!$E$20))","v":""},0,"","","","","","","",null,null,null,null,null,null,null,null,null,null,null,null,null,null,null,null,null,null,null,null,null,null,null,null,null,null,null,null,null,null,null,null,null,null,null,null,null,null,null,null,null,null,null,null,null,null,null,null,null,null,null,null,null,"","","","","","","","","","","","","","","","","","","","","","","","","","","","","","","","","","","","","","",null,null,"","","","","","","","","","","","","","","","","","","","","","","","","","","","",""]
[125,null,null,null,null,null,null,null,null,null,null,null,null,null,null,null,null,null,null,null,null,null,null,null,null,null,null,null,null,null,null,null,null,null,null,null,null,null,null,null,null,null,null,null,null,null,null,null,null,null,null,null,null,null,null,null,null,null,null,null,null,null,null,null,null,null,null,null,null,null,null,null,null,null,null,null,null,null,null,null,null,null,null,0,"","","","","","","","","","","","","","","","","","","","","","","","","","","","","","","","","","",null,null,null,null,null,"","","","","","","","",null,null,null,null,null,"","","","","","","","","",null,null,0,{"$f":"IF(Z134<>\"新規\",\"\",IF(AI134=3,基本!$E$14,IF(OR(AI134=1,AI134=2),基本!$E$13,\"\")))","v":""},{"$f":"IF(CF134=0,\"\",IF(AI134=3,基本!$E$16*CF134,IF(OR(AI134=1,AI134=2),基本!$E$15*CF134)))","v":""},{"$f":"IF(AJ134=\"\",\"\",IF(AJ134>0,基本!$E$17*CF134))","v":""},{"$f":"IF(ER134=0,\"\",IF(AM134<=4,基本!$E$18*ER134,IF(AM134>4,基本!$E$19*ER134)))","v":""},{"$f":"IF(AC134=\"\",\"\",IF(AC134>=1,基本!$E$20))","v":""},0,"","","","","","","",null,null,null,null,null,null,null,null,null,null,null,null,null,null,null,null,null,null,null,null,null,null,null,null,null,null,null,null,null,null,null,null,null,null,null,null,null,null,null,null,null,null,null,null,null,null,null,null,null,null,null,null,null,"","","","","","","","","","","","","","","","","","","","","","","","","","","","","","","","","","","","","","",null,null,"","","","","","","","","","","","","","","","","","","","","","","","","","","","",""]
[126,null,null,null,null,null,null,null,null,null,null,null,null,null,null,null,null,null,null,null,null,null,null,null,null,null,null,null,null,null,null,null,null,null,null,null,null,null,null,null,null,null,null,null,null,null,null,null,null,null,null,null,null,null,null,null,null,null,null,null,null,null,null,null,null,null,null,null,null,null,null,null,null,null,null,null,null,null,null,null,null,null,null,0,"","","","","","","","","","","","","","","","","","","","","","","","","","","","","","","","","","",null,null,null,null,null,"","","","","","","","",null,null,null,null,null,"","","","","","","","","",null,null,0,{"$f":"IF(Z135<>\"新規\",\"\",IF(AI135=3,基本!$E$14,IF(OR(AI135=1,AI135=2),基本!$E$13,\"\")))","v":""},{"$f":"IF(CF135=0,\"\",IF(AI135=3,基本!$E$16*CF135,IF(OR(AI135=1,AI135=2),基本!$E$15*CF135)))","v":""},{"$f":"IF(AJ135=\"\",\"\",IF(AJ135>0,基本!$E$17*CF135))","v":""},{"$f":"IF(ER135=0,\"\",IF(AM135<=4,基本!$E$18*ER135,IF(AM135>4,基本!$E$19*ER135)))","v":""},{"$f":"IF(AC135=\"\",\"\",IF(AC135>=1,基本!$E$20))","v":""},0,"","","","","","","",null,null,null,null,null,null,null,null,null,null,null,null,null,null,null,null,null,null,null,null,null,null,null,null,null,null,null,null,null,null,null,null,null,null,null,null,null,null,null,null,null,null,null,null,null,null,null,null,null,null,null,null,null,"","","","","","","","","","","","","","","","","","","","","","","","","","","","","","","","","","","","","","",null,null,"","","","","","","","","","","","","","","","","","","","","","","","","","","","",""]
[127,null,null,null,null,null,null,null,null,null,null,null,null,null,null,null,null,null,null,null,null,null,null,null,null,null,null,null,null,null,null,null,null,null,null,null,null,null,null,null,null,null,null,null,null,null,null,null,null,null,null,null,null,null,null,null,null,null,null,null,null,null,null,null,null,null,null,null,null,null,null,null,null,null,null,null,null,null,null,null,null,null,null,0,"","","","","","","","","","","","","","","","","","","","","","","","","","","","","","","","","","",null,null,null,null,null,"","","","","","","","",null,null,null,null,null,"","","","","","","","","",null,null,0,{"$f":"IF(Z136<>\"新規\",\"\",IF(AI136=3,基本!$E$14,IF(OR(AI136=1,AI136=2),基本!$E$13,\"\")))","v":""},{"$f":"IF(CF136=0,\"\",IF(AI136=3,基本!$E$16*CF136,IF(OR(AI136=1,AI136=2),基本!$E$15*CF136)))","v":""},{"$f":"IF(AJ136=\"\",\"\",IF(AJ136>0,基本!$E$17*CF136))","v":""},{"$f":"IF(ER136=0,\"\",IF(AM136<=4,基本!$E$18*ER136,IF(AM136>4,基本!$E$19*ER136)))","v":""},{"$f":"IF(AC136=\"\",\"\",IF(AC136>=1,基本!$E$20))","v":""},0,"","","","","","","",null,null,null,null,null,null,null,null,null,null,null,null,null,null,null,null,null,null,null,null,null,null,null,null,null,null,null,null,null,null,null,null,null,null,null,null,null,null,null,null,null,null,null,null,null,null,null,null,null,null,null,null,null,"","","","","","","","","","","","","","","","","","","","","","","","","","","","","","","","","","","","","","",null,null,"","","","","","","","","","","","","","","","","","","","","","","","","","","","",""]
[128,null,null,null,null,null,null,null,null,null,null,null,null,null,null,null,null,null,null,null,null,null,null,null,null,null,null,null,null,null,null,null,null,null,null,null,null,null,null,null,null,null,null,null,null,null,null,null,null,null,null,null,null,null,null,null,null,null,null,null,null,null,null,null,null,null,null,null,null,null,null,null,null,null,null,null,null,null,null,null,null,null,null,0,"","","","","","","","","","","","","","","","","","","","","","","","","","","","","","","","","","",null,null,null,null,null,"","","","","","","","",null,null,null,null,null,"","","","","","","","","",null,null,0,{"$f":"IF(Z137<>\"新規\",\"\",IF(AI137=3,基本!$E$14,IF(OR(AI137=1,AI137=2),基本!$E$13,\"\")))","v":""},{"$f":"IF(CF137=0,\"\",IF(AI137=3,基本!$E$16*CF137,IF(OR(AI137=1,AI137=2),基本!$E$15*CF137)))","v":""},{"$f":"IF(AJ137=\"\",\"\",IF(AJ137>0,基本!$E$17*CF137))","v":""},{"$f":"IF(ER137=0,\"\",IF(AM137<=4,基本!$E$18*ER137,IF(AM137>4,基本!$E$19*ER137)))","v":""},{"$f":"IF(AC137=\"\",\"\",IF(AC137>=1,基本!$E$20))","v":""},0,"","","","","","","",null,null,null,null,null,null,null,null,null,null,null,null,null,null,null,null,null,null,null,null,null,null,null,null,null,null,null,null,null,null,null,null,null,null,null,null,null,null,null,null,null,null,null,null,null,null,null,null,null,null,null,null,null,"","","","","","","","","","","","","","","","","","","","","","","","","","","","","","","","","","","","","","",null,null,"","","","","","","","","","","","","","","","","","","","","","","","","","","","",""]
[129,null,null,null,null,null,null,null,null,null,null,null,null,null,null,null,null,null,null,null,null,null,null,null,null,null,null,null,null,null,null,null,null,null,null,null,null,null,null,null,null,null,null,null,null,null,null,null,null,null,null,null,null,null,null,null,null,null,null,null,null,null,null,null,null,null,null,null,null,null,null,null,null,null,null,null,null,null,null,null,null,null,null,0,"","","","","","","","","","","","","","","","","","","","","","","","","","","","","","","","","","",null,null,null,null,null,"","","","","","","","",null,null,null,null,null,"","","","","","","","","",null,null,0,{"$f":"IF(Z138<>\"新規\",\"\",IF(AI138=3,基本!$E$14,IF(OR(AI138=1,AI138=2),基本!$E$13,\"\")))","v":""},{"$f":"IF(CF138=0,\"\",IF(AI138=3,基本!$E$16*CF138,IF(OR(AI138=1,AI138=2),基本!$E$15*CF138)))","v":""},{"$f":"IF(AJ138=\"\",\"\",IF(AJ138>0,基本!$E$17*CF138))","v":""},{"$f":"IF(ER138=0,\"\",IF(AM138<=4,基本!$E$18*ER138,IF(AM138>4,基本!$E$19*ER138)))","v":""},{"$f":"IF(AC138=\"\",\"\",IF(AC138>=1,基本!$E$20))","v":""},0,{"$f":"IF($E138=\"\",\"\",IF($E138=\"協会けんぽ\",$EX138,\"\"))","v":""},{"$f":"IF($E138=\"\",\"\",IF($E138=\"健保組合\",$EX138,\"\"))","v":""},{"$f":"IF($E138=\"\",\"\",IF($E138=\"国保一般\",$EX138,\"\"))","v":""},{"$f":"IF($E138=\"\",\"\",IF($E138=\"後期高齢者\",$EX138,\"\"))","v":""},{"$f":"IF($E138=\"\",\"\",IF($E138=\"共済組合\",$EX138,\"\"))","v":""},{"$f":"IF($E138=\"\",\"\",IF($E138=\"退職者国保\",$EX138,\"\"))","v":""},{"$f":"IF($E138=\"\",\"\",IF($E138=\"国保組合\",$EX138,\"\"))","v":""},null,null,null,null,null,null,null,null,null,null,null,null,null,null,null,null,null,null,null,null,null,null,null,null,null,null,null,null,null,null,null,null,null,null,null,null,null,null,null,null,null,null,null,null,null,null,null,null,null,null,null,null,null,"","","","","","","","","","","","","","","","","","","","","","","","","","","","","","","","","","","","","","",null,null,"","","","","","","","","","","","","","","","","","","","","","","","","","","","",""]
[130,null,null,null,null,null,null,null,null,null,null,null,null,null,null,null,null,null,null,null,null,null,null,null,null,null,null,null,null,null,null,null,null,null,null,null,null,null,null,null,null,null,null,null,null,null,null,null,null,null,null,null,null,null,null,null,null,null,null,null,null,null,null,null,null,null,null,null,null,null,null,null,null,null,null,null,null,null,null,null,null,null,null,0,"","","","","","","","","","","","","","","","","","","","","","","",{"$f":"IF($CZ139=\"T\",1911,IF($CZ139=\"S\",1925,IF($CZ139=\"H\",1988,IF($CZ139=\"R\",2018,\"\"))))","v":""},"","","","","","","","","","",null,null,null,null,null,"","","","","","","","",null,null,null,null,null,"","","","","","","","","",null,null,0,{"$f":"IF(Z139<>\"新規\",\"\",IF(AI139=3,基本!$E$14,IF(OR(AI139=1,AI139=2),基本!$E$13,\"\")))","v":""},{"$f":"IF(CF139=0,\"\",IF(AI139=3,基本!$E$16*CF139,IF(OR(AI139=1,AI139=2),基本!$E$15*CF139)))","v":""},{"$f":"IF(AJ139=\"\",\"\",IF(AJ139>0,基本!$E$17*CF139))","v":""},{"$f":"IF(ER139=0,\"\",IF(AM139<=4,基本!$E$18*ER139,IF(AM139>4,基本!$E$19*ER139)))","v":""},{"$f":"IF(AC139=\"\",\"\",IF(AC139>=1,基本!$E$20))","v":""},0,"","","","","","","",null,null,null,null,null,null,null,null,null,null,null,null,null,null,null,null,null,null,null,null,null,null,null,null,null,null,null,null,null,null,null,null,null,null,null,null,null,null,null,null,null,null,null,null,null,null,null,null,null,null,null,null,null,"","","","","","","","","","","","","","","","","","","","","","","","","","","","","","","","","","","","","","",null,null,"","","","","","","","","","","","","","","","","","","","","","","","","",{"$f":"IF(JO139=8,MID(JN139,5,1),IF(JO139=7,MID(JN139,4,1),IF(JO139=6,MID(JN139,3,1),IF(JO139=5,MID(JN139,2,1),IF(JO139=4,LEFT(JN139),\"\")))))","v":""},"","",""]
[131,null,null,null,null,null,null,null,null,null,null,null,null,null,null,null,null,null,null,null,null,null,null,null,null,null,null,null,null,null,null,null,null,null,null,null,null,null,null,null,null,null,null,null,null,null,null,null,null,null,null,null,null,null,null,null,null,null,null,null,null,null,null,null,null,null,null,null,null,null,null,null,null,null,null,null,null,null,null,null,null,null,null,0,"","","","","","","","","","","","","","","","","","","","","","","","","","","","","","","","","","",null,null,null,null,null,"","","","","","","","",null,null,null,null,null,"","","","","","","","","",null,null,0,{"$f":"IF(Z140<>\"新規\",\"\",IF(AI140=3,基本!$E$14,IF(OR(AI140=1,AI140=2),基本!$E$13,\"\")))","v":""},{"$f":"IF(CF140=0,\"\",IF(AI140=3,基本!$E$16*CF140,IF(OR(AI140=1,AI140=2),基本!$E$15*CF140)))","v":""},{"$f":"IF(AJ140=\"\",\"\",IF(AJ140>0,基本!$E$17*CF140))","v":""},{"$f":"IF(ER140=0,\"\",IF(AM140<=4,基本!$E$18*ER140,IF(AM140>4,基本!$E$19*ER140)))","v":""},{"$f":"IF(AC140=\"\",\"\",IF(AC140>=1,基本!$E$20))","v":""},0,"","","","","","","",null,null,null,null,null,null,null,null,null,null,null,null,null,null,null,null,null,null,null,null,null,null,null,null,null,null,null,null,null,null,null,null,null,null,null,null,null,null,null,null,null,null,null,null,null,null,null,null,null,null,null,null,null,"","","","","","","","","","","","","","","","","","","","","","","","","","","","","","","","","","","","","","",null,null,"","","","","","","","","","","","","","","","","","","","","","","","","","","","",""]
[132,null,null,null,null,null,null,null,null,null,null,null,null,null,null,null,null,null,null,null,null,null,null,null,null,null,null,null,null,null,null,null,null,null,null,null,null,null,null,null,null,null,null,null,null,null,null,null,null,null,null,null,null,null,null,null,null,null,null,null,null,null,null,null,null,null,null,null,null,null,null,null,null,null,null,null,null,null,null,null,null,null,null,0,"","","","","","","","","","","","","","","","","","","","","","","","","","","","","","","","","","",null,null,null,null,null,"","","","","","","","",null,null,null,null,null,"","","","","","","","","",null,null,0,{"$f":"IF(Z141<>\"新規\",\"\",IF(AI141=3,基本!$E$14,IF(OR(AI141=1,AI141=2),基本!$E$13,\"\")))","v":""},{"$f":"IF(CF141=0,\"\",IF(AI141=3,基本!$E$16*CF141,IF(OR(AI141=1,AI141=2),基本!$E$15*CF141)))","v":""},{"$f":"IF(AJ141=\"\",\"\",IF(AJ141>0,基本!$E$17*CF141))","v":""},{"$f":"IF(ER141=0,\"\",IF(AM141<=4,基本!$E$18*ER141,IF(AM141>4,基本!$E$19*ER141)))","v":""},{"$f":"IF(AC141=\"\",\"\",IF(AC141>=1,基本!$E$20))","v":""},0,"","","","","","","",null,null,null,null,null,null,null,null,null,null,null,null,null,null,null,null,null,null,null,null,null,null,null,null,null,null,null,null,null,null,null,null,null,null,null,null,null,null,null,null,null,null,null,null,null,null,null,null,null,null,null,null,null,"","","","","","","","","","","","","","","","","","","","","","","","","","","","","","","","","","","","","","",null,null,"","","","","","","","","","","","","","","","","","","","","","","","","","","","",""]
[133,null,null,null,null,null,null,null,null,null,null,null,null,null,null,null,null,null,null,null,null,null,null,null,null,null,null,null,null,null,null,null,null,null,null,null,null,null,null,null,null,null,null,null,null,null,null,null,null,null,null,null,null,null,null,null,null,null,null,null,null,null,null,null,null,null,null,null,null,null,null,null,null,null,null,null,null,null,null,null,null,null,null,0,"","","","","","","","","","","","","","","","","","","","","","","","","","","","","","","","","","",null,null,null,null,null,"","","","","","","","",null,null,null,null,null,"","","","","","","","","",null,null,0,{"$f":"IF(Z142<>\"新規\",\"\",IF(AI142=3,基本!$E$14,IF(OR(AI142=1,AI142=2),基本!$E$13,\"\")))","v":""},{"$f":"IF(CF142=0,\"\",IF(AI142=3,基本!$E$16*CF142,IF(OR(AI142=1,AI142=2),基本!$E$15*CF142)))","v":""},{"$f":"IF(AJ142=\"\",\"\",IF(AJ142>0,基本!$E$17*CF142))","v":""},{"$f":"IF(ER142=0,\"\",IF(AM142<=4,基本!$E$18*ER142,IF(AM142>4,基本!$E$19*ER142)))","v":""},{"$f":"IF(AC142=\"\",\"\",IF(AC142>=1,基本!$E$20))","v":""},0,"","","","","","","",null,null,null,null,null,null,null,null,null,null,null,null,null,null,null,null,null,null,null,null,null,null,null,null,null,null,null,null,null,null,null,null,null,null,null,null,null,null,null,null,null,null,null,null,null,null,null,null,null,null,null,null,null,"","","","","","","","","","","","","","","","","","","","","","","","","","","","","","","","","","","","","","",null,null,"","","","","","","","","","","","","","","","","","","","","","","","","","","","",""]
[134,null,null,null,null,null,null,null,null,null,null,null,null,null,null,null,null,null,null,null,null,null,null,null,null,null,null,null,null,null,null,null,null,null,null,null,null,null,null,null,null,null,null,null,null,null,null,null,null,null,null,null,null,null,null,null,null,null,null,null,null,null,null,null,null,null,null,null,null,null,null,null,null,null,null,null,null,null,null,null,null,null,null,0,"","","","","","","","","","","","","","","","","","","","","","","","","","","","","","","","","","",null,null,null,null,null,"","","","","","","","",null,null,null,null,null,"","","","","","","","","",null,null,0,{"$f":"IF(Z143<>\"新規\",\"\",IF(AI143=3,基本!$E$14,IF(OR(AI143=1,AI143=2),基本!$E$13,\"\")))","v":""},{"$f":"IF(CF143=0,\"\",IF(AI143=3,基本!$E$16*CF143,IF(OR(AI143=1,AI143=2),基本!$E$15*CF143)))","v":""},{"$f":"IF(AJ143=\"\",\"\",IF(AJ143>0,基本!$E$17*CF143))","v":""},{"$f":"IF(ER143=0,\"\",IF(AM143<=4,基本!$E$18*ER143,IF(AM143>4,基本!$E$19*ER143)))","v":""},{"$f":"IF(AC143=\"\",\"\",IF(AC143>=1,基本!$E$20))","v":""},0,"","","","","","","",null,null,null,null,null,null,null,null,null,null,null,null,null,null,null,null,null,null,null,null,null,null,null,null,null,null,null,null,null,null,null,null,null,null,null,null,null,null,null,null,null,null,null,null,null,null,null,null,null,null,null,null,null,"","","","","","","","","","","","","","","","","","","","","","","","","","","","","","","","","","","","","","",null,null,"","","","","","","","","","","","","","","","","","","","","","","","","","","","",""]
[135,null,null,null,null,null,null,null,null,null,null,null,null,null,null,null,null,null,null,null,null,null,null,null,null,null,null,null,null,null,null,null,null,null,null,null,null,null,null,null,null,null,null,null,null,null,null,null,null,null,null,null,null,null,null,null,null,null,null,null,null,null,null,null,null,null,null,null,null,null,null,null,null,null,null,null,null,null,null,null,null,null,null,0,"","","","","","","","","","","","","","","","","","","","","","","","","","","","","","","","","","",null,null,null,null,null,"","","","","","","","",null,null,null,null,null,"","","","","","","","","",null,null,0,{"$f":"IF(Z144<>\"新規\",\"\",IF(AI144=3,基本!$E$14,IF(OR(AI144=1,AI144=2),基本!$E$13,\"\")))","v":""},{"$f":"IF(CF144=0,\"\",IF(AI144=3,基本!$E$16*CF144,IF(OR(AI144=1,AI144=2),基本!$E$15*CF144)))","v":""},{"$f":"IF(AJ144=\"\",\"\",IF(AJ144>0,基本!$E$17*CF144))","v":""},{"$f":"IF(ER144=0,\"\",IF(AM144<=4,基本!$E$18*ER144,IF(AM144>4,基本!$E$19*ER144)))","v":""},{"$f":"IF(AC144=\"\",\"\",IF(AC144>=1,基本!$E$20))","v":""},0,"","","","","","","",null,null,null,null,null,null,null,null,null,null,null,null,null,null,null,null,null,null,null,null,null,null,null,null,null,null,null,null,null,null,null,null,null,null,null,null,null,null,null,null,null,null,null,null,null,null,null,null,null,null,null,null,null,"","","","","","","","","","","","","","","","","","","","","","","","","","","","","","","","","","","","","","",null,null,"","","","","","","","","","","","","","","","","","","","","","","","","","","","",""]
[136,null,null,null,null,null,null,null,null,null,null,null,null,null,null,null,null,null,null,null,null,null,null,null,null,null,null,null,null,null,null,null,null,null,null,null,null,null,null,null,null,null,null,null,null,null,null,null,null,null,null,null,null,null,null,null,null,null,null,null,null,null,null,null,null,null,null,null,null,null,null,null,null,null,null,null,null,null,null,null,null,null,null,0,"","","","","","","","","","","","","","","","","","","","","","","","","","","","","","","","","","",null,null,null,null,null,"","","","","","","","",null,null,null,null,null,"","","","","","","","","",null,null,0,{"$f":"IF(Z145<>\"新規\",\"\",IF(AI145=3,基本!$E$14,IF(OR(AI145=1,AI145=2),基本!$E$13,\"\")))","v":""},{"$f":"IF(CF145=0,\"\",IF(AI145=3,基本!$E$16*CF145,IF(OR(AI145=1,AI145=2),基本!$E$15*CF145)))","v":""},{"$f":"IF(AJ145=\"\",\"\",IF(AJ145>0,基本!$E$17*CF145))","v":""},{"$f":"IF(ER145=0,\"\",IF(AM145<=4,基本!$E$18*ER145,IF(AM145>4,基本!$E$19*ER145)))","v":""},{"$f":"IF(AC145=\"\",\"\",IF(AC145>=1,基本!$E$20))","v":""},0,"","","","","","","",null,null,null,null,null,null,null,null,null,null,null,null,null,null,null,null,null,null,null,null,null,null,null,null,null,null,null,null,null,null,null,null,null,null,null,null,null,null,null,null,null,null,null,null,null,null,null,null,null,null,null,null,null,"","","","","","","","","","","","","","","","","","","","","","","","","","","","","","","","","","","","","","",null,null,"","","","","","","","","","","","","","","","","","","","","","","","","","","","",""]
[137,null,null,null,null,null,null,null,null,null,null,null,null,null,null,null,null,null,null,null,null,null,null,null,null,null,null,null,null,null,null,null,null,null,null,null,null,null,null,null,null,null,null,null,null,null,null,null,null,null,null,null,null,null,null,null,null,null,null,null,null,null,null,null,null,null,null,null,null,null,null,null,null,null,null,null,null,null,null,null,null,null,null,0,"","","","","","","","","","","","","","","","","","","","","","","","","","","","","","","","","","",null,null,null,null,null,"","","","","","","","",null,null,null,null,null,"","","","","","","","","",null,null,0,{"$f":"IF(Z146<>\"新規\",\"\",IF(AI146=3,基本!$E$14,IF(OR(AI146=1,AI146=2),基本!$E$13,\"\")))","v":""},{"$f":"IF(CF146=0,\"\",IF(AI146=3,基本!$E$16*CF146,IF(OR(AI146=1,AI146=2),基本!$E$15*CF146)))","v":""},{"$f":"IF(AJ146=\"\",\"\",IF(AJ146>0,基本!$E$17*CF146))","v":""},{"$f":"IF(ER146=0,\"\",IF(AM146<=4,基本!$E$18*ER146,IF(AM146>4,基本!$E$19*ER146)))","v":""},{"$f":"IF(AC146=\"\",\"\",IF(AC146>=1,基本!$E$20))","v":""},0,"","","","","","","",null,null,null,null,null,null,null,null,null,null,null,null,null,null,null,null,null,null,null,null,null,null,null,null,null,null,null,null,null,null,null,null,null,null,null,null,null,null,null,null,null,null,null,null,null,null,null,null,null,null,null,null,null,"","","","","","","","","","","","","","","","","","","","","","","","","","","","","","","","","","","","","","",null,null,"","","","","","","","","","","","","","","","","","","","","","","","","","","","",""]
[138,null,null,null,null,null,null,null,null,null,null,null,null,null,null,null,null,null,null,null,null,null,null,null,null,null,null,null,null,null,null,null,null,null,null,null,null,null,null,null,null,null,null,null,null,null,null,null,null,null,null,null,null,null,null,null,null,null,null,null,null,null,null,null,null,null,null,null,null,null,null,null,null,null,null,null,null,null,null,null,null,null,null,0,"","","","","","","","","","","","","","","","","","","","","","","","","","","","","","","","","","",null,null,null,null,null,"","","","","","","","",null,null,null,null,null,"","","","","","","","","",null,null,0,{"$f":"IF(Z147<>\"新規\",\"\",IF(AI147=3,基本!$E$14,IF(OR(AI147=1,AI147=2),基本!$E$13,\"\")))","v":""},{"$f":"IF(CF147=0,\"\",IF(AI147=3,基本!$E$16*CF147,IF(OR(AI147=1,AI147=2),基本!$E$15*CF147)))","v":""},{"$f":"IF(AJ147=\"\",\"\",IF(AJ147>0,基本!$E$17*CF147))","v":""},{"$f":"IF(ER147=0,\"\",IF(AM147<=4,基本!$E$18*ER147,IF(AM147>4,基本!$E$19*ER147)))","v":""},{"$f":"IF(AC147=\"\",\"\",IF(AC147>=1,基本!$E$20))","v":""},0,"","","","","","","",null,null,null,null,null,null,null,null,null,null,null,null,null,null,null,null,null,null,null,null,null,null,null,null,null,null,null,null,null,null,null,null,null,null,null,null,null,null,null,null,null,null,null,null,null,null,null,null,null,null,null,null,null,"","","","","","","","","","","","","","","","","","","","","","","","","","","","","","","","","","","","","","",null,null,"","","","","","","","","","","","","","","","","","","","","","","","","","","","",""]
[139,null,null,null,null,null,null,null,null,null,null,null,null,null,null,null,null,null,null,null,null,null,null,null,null,null,null,null,null,null,null,null,null,null,null,null,null,null,null,null,null,null,null,null,null,null,null,null,null,null,null,null,null,null,null,null,null,null,null,null,null,null,null,null,null,null,null,null,null,null,null,null,null,null,null,null,null,null,null,null,null,null,null,0,"","","","","","","","","","","","","","","","","","","","","","","","","","","","","","","","","","",null,null,null,null,null,"","","","","","","","",null,null,null,null,null,"","","","","","","","","",null,null,0,{"$f":"IF(Z148<>\"新規\",\"\",IF(AI148=3,基本!$E$14,IF(OR(AI148=1,AI148=2),基本!$E$13,\"\")))","v":""},{"$f":"IF(CF148=0,\"\",IF(AI148=3,基本!$E$16*CF148,IF(OR(AI148=1,AI148=2),基本!$E$15*CF148)))","v":""},{"$f":"IF(AJ148=\"\",\"\",IF(AJ148>0,基本!$E$17*CF148))","v":""},{"$f":"IF(ER148=0,\"\",IF(AM148<=4,基本!$E$18*ER148,IF(AM148>4,基本!$E$19*ER148)))","v":""},{"$f":"IF(AC148=\"\",\"\",IF(AC148>=1,基本!$E$20))","v":""},0,"","","","","","","",null,null,null,null,null,null,null,null,null,null,null,null,null,null,null,null,null,null,null,null,null,null,null,null,null,null,null,null,null,null,null,null,null,null,null,null,null,null,null,null,null,null,null,null,null,null,null,null,null,null,null,null,null,"","","","","","","","","","","","","","","","","","","","","","","","","","","","","","","","","","","","","","",null,null,"","","","","","","","","","","","","","","","","","","","","","","","","","","","",""]
[140,null,null,null,null,null,null,null,null,null,null,null,null,null,null,null,null,null,null,null,null,null,null,null,null,null,null,null,null,null,null,null,null,null,null,null,null,null,null,null,null,null,null,null,null,null,null,null,null,null,null,null,null,null,null,null,null,null,null,null,null,null,null,null,null,null,null,null,null,null,null,null,null,null,null,null,null,null,null,null,null,null,null,0,"","","","","","","","","","","","","","","","","","","","","","","","","","","","","","","","","","",null,null,null,null,null,"","","","","","","","",null,null,null,null,null,"","","","","","","","","",null,null,0,{"$f":"IF(Z149<>\"新規\",\"\",IF(AI149=3,基本!$E$14,IF(OR(AI149=1,AI149=2),基本!$E$13,\"\")))","v":""},{"$f":"IF(CF149=0,\"\",IF(AI149=3,基本!$E$16*CF149,IF(OR(AI149=1,AI149=2),基本!$E$15*CF149)))","v":""},{"$f":"IF(AJ149=\"\",\"\",IF(AJ149>0,基本!$E$17*CF149))","v":""},{"$f":"IF(ER149=0,\"\",IF(AM149<=4,基本!$E$18*ER149,IF(AM149>4,基本!$E$19*ER149)))","v":""},{"$f":"IF(AC149=\"\",\"\",IF(AC149>=1,基本!$E$20))","v":""},0,"","","","","","","",null,null,null,null,null,null,null,null,null,null,null,null,null,null,null,null,null,null,null,null,null,null,null,null,null,null,null,null,null,null,null,null,null,null,null,null,null,null,null,null,null,null,null,null,null,null,null,null,null,null,null,null,null,"","","","","","","","","","","","","","","","","","","","","","","","","","","","","","","","","","","","","","",null,null,"","","","","","","","","","","","","","","","","","","","","","","","","","","","",""]
[141,null,null,null,null,null,null,null,null,null,null,null,null,null,null,null,null,null,null,null,null,null,null,null,null,null,null,null,null,null,null,null,null,null,null,null,null,null,null,null,null,null,null,null,null,null,null,null,null,null,null,null,null,null,null,null,null,null,null,null,null,null,null,null,null,null,null,null,null,null,null,null,null,null,null,null,null,null,null,null,null,null,null,0,"","","","","","","","","","","","","","","","","","","","","","","","","","","","","","","","","","",null,null,null,null,null,"","","","","","","","",null,null,null,null,null,"","","","","","","","","",null,null,0,{"$f":"IF(Z150<>\"新規\",\"\",IF(AI150=3,基本!$E$14,IF(OR(AI150=1,AI150=2),基本!$E$13,\"\")))","v":""},{"$f":"IF(CF150=0,\"\",IF(AI150=3,基本!$E$16*CF150,IF(OR(AI150=1,AI150=2),基本!$E$15*CF150)))","v":""},{"$f":"IF(AJ150=\"\",\"\",IF(AJ150>0,基本!$E$17*CF150))","v":""},{"$f":"IF(ER150=0,\"\",IF(AM150<=4,基本!$E$18*ER150,IF(AM150>4,基本!$E$19*ER150)))","v":""},{"$f":"IF(AC150=\"\",\"\",IF(AC150>=1,基本!$E$20))","v":""},0,"","","","","","","",null,null,null,null,null,null,null,null,null,null,null,null,null,null,null,null,null,null,null,null,null,null,null,null,null,null,null,null,null,null,null,null,null,null,null,null,null,null,null,null,null,null,null,null,null,null,null,null,null,null,null,null,null,"","","","","","","","","","","","","","","","","","","","","","","","","","","","","","","","","","","","","","",null,null,"","","","","","","","","","","","","","","","","","","","","","","","","","","","",""]
[142,null,null,null,null,null,null,null,null,null,null,null,null,null,null,null,null,null,null,null,null,null,null,null,null,null,null,null,null,null,null,null,null,null,null,null,null,null,null,null,null,null,null,null,null,null,null,null,null,null,null,null,null,null,null,null,null,null,null,null,null,null,null,null,null,null,null,null,null,null,null,null,null,null,null,null,null,null,null,null,null,null,null,0,"","","","","","","","","","","","","","","","","","","","","","","","","","","","","","","","","","",null,null,null,null,null,"","","","","","","","",null,null,null,null,null,"","","","","","","","","",null,null,0,{"$f":"IF(Z151<>\"新規\",\"\",IF(AI151=3,基本!$E$14,IF(OR(AI151=1,AI151=2),基本!$E$13,\"\")))","v":""},{"$f":"IF(CF151=0,\"\",IF(AI151=3,基本!$E$16*CF151,IF(OR(AI151=1,AI151=2),基本!$E$15*CF151)))","v":""},{"$f":"IF(AJ151=\"\",\"\",IF(AJ151>0,基本!$E$17*CF151))","v":""},{"$f":"IF(ER151=0,\"\",IF(AM151<=4,基本!$E$18*ER151,IF(AM151>4,基本!$E$19*ER151)))","v":""},{"$f":"IF(AC151=\"\",\"\",IF(AC151>=1,基本!$E$20))","v":""},0,"","","","","","","",null,null,null,null,null,null,null,null,null,null,null,null,null,null,null,null,null,null,null,null,null,null,null,null,null,null,null,null,null,null,null,null,null,null,null,null,null,null,null,null,null,null,null,null,null,null,null,null,null,null,null,null,null,"","","","","","","","","","","","","","","","","","","","","","","","","","","","","","","","","","","","","","",null,null,"","","","","","","","","","","","","","","","","","","","","","","","","","","","",""]
[143,null,null,null,null,null,null,null,null,null,null,null,null,null,null,null,null,null,null,null,null,null,null,null,null,null,null,null,null,null,null,null,null,null,null,null,null,null,null,null,null,null,null,null,null,null,null,null,null,null,null,null,null,null,null,null,null,null,null,null,null,null,null,null,null,null,null,null,null,null,null,null,null,null,null,null,null,null,null,null,null,null,null,0,"","","","","","","","","","","","","","","","","","","","","","","","","","","","","","","","","","",null,null,null,null,null,"","","","","","","","",null,null,null,null,null,"","","","","","","","","",null,null,0,{"$f":"IF(Z152<>\"新規\",\"\",IF(AI152=3,基本!$E$14,IF(OR(AI152=1,AI152=2),基本!$E$13,\"\")))","v":""},{"$f":"IF(CF152=0,\"\",IF(AI152=3,基本!$E$16*CF152,IF(OR(AI152=1,AI152=2),基本!$E$15*CF152)))","v":""},{"$f":"IF(AJ152=\"\",\"\",IF(AJ152>0,基本!$E$17*CF152))","v":""},{"$f":"IF(ER152=0,\"\",IF(AM152<=4,基本!$E$18*ER152,IF(AM152>4,基本!$E$19*ER152)))","v":""},{"$f":"IF(AC152=\"\",\"\",IF(AC152>=1,基本!$E$20))","v":""},0,"","","","","","","",null,null,null,null,null,null,null,null,null,null,null,null,null,null,null,null,null,null,null,null,null,null,null,null,null,null,null,null,null,null,null,null,null,null,null,null,null,null,null,null,null,null,null,null,null,null,null,null,null,null,null,null,null,"","","","","","","","","","","","","","","","","","","","","","","","","","","","","","","","","","","","","","",null,null,"","","","","","","","","","","","","","","","","","","","","","","","","","","","",""]
[144,null,null,null,null,null,null,null,null,null,null,null,null,null,null,null,null,null,null,null,null,null,null,null,null,null,null,null,null,null,null,null,null,null,null,null,null,null,null,null,null,null,null,null,null,null,null,null,null,null,null,null,null,null,null,null,null,null,null,null,null,null,null,null,null,null,null,null,null,null,null,null,null,null,null,null,null,null,null,null,null,null,null,0,"","","","","","","","","","","","","","","","","","","","","","","","","","","","","","","","","","",null,null,null,null,null,"","","","","","","","",null,null,null,null,null,"","","","","","","","","",null,null,0,{"$f":"IF(Z153<>\"新規\",\"\",IF(AI153=3,基本!$E$14,IF(OR(AI153=1,AI153=2),基本!$E$13,\"\")))","v":""},{"$f":"IF(CF153=0,\"\",IF(AI153=3,基本!$E$16*CF153,IF(OR(AI153=1,AI153=2),基本!$E$15*CF153)))","v":""},{"$f":"IF(AJ153=\"\",\"\",IF(AJ153>0,基本!$E$17*CF153))","v":""},{"$f":"IF(ER153=0,\"\",IF(AM153<=4,基本!$E$18*ER153,IF(AM153>4,基本!$E$19*ER153)))","v":""},{"$f":"IF(AC153=\"\",\"\",IF(AC153>=1,基本!$E$20))","v":""},0,"","","","","","","",null,null,null,null,null,null,null,null,null,null,null,null,null,null,null,null,null,null,null,null,null,null,null,null,null,null,null,null,null,null,null,null,null,null,null,null,null,null,null,null,null,null,null,null,null,null,null,null,null,null,null,null,null,"","","","","","","","","","","","","","","","","","","","","","","","","","","","","","","","","","","","","","",null,null,"","","","","","","","","","","","","","","","","","","","","","","","","","","","",""]
[145,null,null,null,null,null,null,null,null,null,null,null,null,null,null,null,null,null,null,null,null,null,null,null,null,null,null,null,null,null,null,null,null,null,null,null,null,null,null,null,null,null,null,null,null,null,null,null,null,null,null,null,null,null,null,null,null,null,null,null,null,null,null,null,null,null,null,null,null,null,null,null,null,null,null,null,null,null,null,null,null,null,null,0,"","","","","","","","","","","","","","","","","","","","","","","","","","","","","","","","","","",null,null,null,null,null,"","","","","","","","",null,null,null,null,null,"","","","","","","","","",null,null,0,{"$f":"IF(Z154<>\"新規\",\"\",IF(AI154=3,基本!$E$14,IF(OR(AI154=1,AI154=2),基本!$E$13,\"\")))","v":""},{"$f":"IF(CF154=0,\"\",IF(AI154=3,基本!$E$16*CF154,IF(OR(AI154=1,AI154=2),基本!$E$15*CF154)))","v":""},{"$f":"IF(AJ154=\"\",\"\",IF(AJ154>0,基本!$E$17*CF154))","v":""},{"$f":"IF(ER154=0,\"\",IF(AM154<=4,基本!$E$18*ER154,IF(AM154>4,基本!$E$19*ER154)))","v":""},{"$f":"IF(AC154=\"\",\"\",IF(AC154>=1,基本!$E$20))","v":""},0,"","","","","","","",null,null,null,null,null,null,null,null,null,null,null,null,null,null,null,null,null,null,null,null,null,null,null,null,null,null,null,null,null,null,null,null,null,null,null,null,null,null,null,null,null,null,null,null,null,null,null,null,null,null,null,null,null,"","","","","","","","","","","","","","","","","","","","","","","","","","","","","","","","","","","","","","",null,null,"","","","","","","","","","","","","","","","","","","","","","","","","","","","",""]
[146,null,null,null,null,null,null,null,null,null,null,null,null,null,null,null,null,null,null,null,null,null,null,null,null,null,null,null,null,null,null,null,null,null,null,null,null,null,null,null,null,null,null,null,null,null,null,null,null,null,null,null,null,null,null,null,null,null,null,null,null,null,null,null,null,null,null,null,null,null,null,null,null,null,null,null,null,null,null,null,null,null,null,0,"","","","","","","","","","","","","","","","","","","","","","","","","","","","","","","","","","",null,null,null,null,null,"","","","","","","","",null,null,null,null,null,"","","","","","","","","",null,null,0,{"$f":"IF(Z155<>\"新規\",\"\",IF(AI155=3,基本!$E$14,IF(OR(AI155=1,AI155=2),基本!$E$13,\"\")))","v":""},{"$f":"IF(CF155=0,\"\",IF(AI155=3,基本!$E$16*CF155,IF(OR(AI155=1,AI155=2),基本!$E$15*CF155)))","v":""},{"$f":"IF(AJ155=\"\",\"\",IF(AJ155>0,基本!$E$17*CF155))","v":""},{"$f":"IF(ER155=0,\"\",IF(AM155<=4,基本!$E$18*ER155,IF(AM155>4,基本!$E$19*ER155)))","v":""},{"$f":"IF(AC155=\"\",\"\",IF(AC155>=1,基本!$E$20))","v":""},0,"","","","","","","",null,null,null,null,null,null,null,null,null,null,null,null,null,null,null,null,null,null,null,null,null,null,null,null,null,null,null,null,null,null,null,null,null,null,null,null,null,null,null,null,null,null,null,null,null,null,null,null,null,null,null,null,null,"","","","","","","","","","","","","","","","","","","","","","","","","","","","","","","","","","","","","","",null,null,"","","","","","","","","","","","","","","","","","","","","","","","","","","","",""]
[147,null,null,null,null,null,null,null,null,null,null,null,null,null,null,null,null,null,null,null,null,null,null,null,null,null,null,null,null,null,null,null,null,null,null,null,null,null,null,null,null,null,null,null,null,null,null,null,null,null,null,null,null,null,null,null,null,null,null,null,null,null,null,null,null,null,null,null,null,null,null,null,null,null,null,null,null,null,null,null,null,null,null,0,"","","","","","","","","","","","","","","","","","","","","","","","","","","","","","","","","","",null,null,null,null,null,"","","","","","","","",null,null,null,null,null,"","","","","","","","","",null,null,0,{"$f":"IF(Z156<>\"新規\",\"\",IF(AI156=3,基本!$E$14,IF(OR(AI156=1,AI156=2),基本!$E$13,\"\")))","v":""},{"$f":"IF(CF156=0,\"\",IF(AI156=3,基本!$E$16*CF156,IF(OR(AI156=1,AI156=2),基本!$E$15*CF156)))","v":""},{"$f":"IF(AJ156=\"\",\"\",IF(AJ156>0,基本!$E$17*CF156))","v":""},{"$f":"IF(ER156=0,\"\",IF(AM156<=4,基本!$E$18*ER156,IF(AM156>4,基本!$E$19*ER156)))","v":""},{"$f":"IF(AC156=\"\",\"\",IF(AC156>=1,基本!$E$20))","v":""},0,"","","","","","","",null,null,null,null,null,null,null,null,null,null,null,null,null,null,null,null,null,null,null,null,null,null,null,null,null,null,null,null,null,null,null,null,null,null,null,null,null,null,null,null,null,null,null,null,null,null,null,null,null,null,null,null,null,"","","","","","","","","","","","","","","","","","","","","","","","","","","","","","","","","","","","","","",null,null,"","","","","","","","","","","","","","","","","","","","","","","","","","","","",""]
[148,null,null,null,null,null,null,null,null,null,null,null,null,null,null,null,null,null,null,null,null,null,null,null,null,null,null,null,null,null,null,null,null,null,null,null,null,null,null,null,null,null,null,null,null,null,null,null,null,null,null,null,null,null,null,null,null,null,null,null,null,null,null,null,null,null,null,null,null,null,null,null,null,null,null,null,null,null,null,null,null,null,null,0,"","","","","","","","","","","","","","","","","","","","","","","","","","","","","","","","","","",null,null,null,null,null,"","","","","","","","",null,null,null,null,null,"","","","","","","","","",null,null,0,{"$f":"IF(Z157<>\"新規\",\"\",IF(AI157=3,基本!$E$14,IF(OR(AI157=1,AI157=2),基本!$E$13,\"\")))","v":""},{"$f":"IF(CF157=0,\"\",IF(AI157=3,基本!$E$16*CF157,IF(OR(AI157=1,AI157=2),基本!$E$15*CF157)))","v":""},{"$f":"IF(AJ157=\"\",\"\",IF(AJ157>0,基本!$E$17*CF157))","v":""},{"$f":"IF(ER157=0,\"\",IF(AM157<=4,基本!$E$18*ER157,IF(AM157>4,基本!$E$19*ER157)))","v":""},{"$f":"IF(AC157=\"\",\"\",IF(AC157>=1,基本!$E$20))","v":""},0,"","","","","","","",null,null,null,null,null,null,null,null,null,null,null,null,null,null,null,null,null,null,null,null,null,null,null,null,null,null,null,null,null,null,null,null,null,null,null,null,null,null,null,null,null,null,null,null,null,null,null,null,null,null,null,null,null,"","","","","","","","","","","","","","","","","","","","","","","","","","","","","","","","","","","","","","",null,null,"","","","","","","","","","","","","","","","","","","","","","","","","","","","",""]
[149,null,null,null,null,null,null,null,null,null,null,null,null,null,null,null,null,null,null,null,null,null,null,null,null,null,null,null,null,null,null,null,null,null,null,null,null,null,null,null,null,null,null,null,null,null,null,null,null,null,null,null,null,null,null,null,null,null,null,null,null,null,null,null,null,null,null,null,null,null,null,null,null,null,null,null,null,null,null,null,null,null,null,0,"","","","","","","","","","","","","","","","","","","","","","","","","","","","","","","","","","",null,null,null,null,null,"","","","","","","","",null,null,null,null,null,"","","","","","","","","",null,null,0,{"$f":"IF(Z158<>\"新規\",\"\",IF(AI158=3,基本!$E$14,IF(OR(AI158=1,AI158=2),基本!$E$13,\"\")))","v":""},{"$f":"IF(CF158=0,\"\",IF(AI158=3,基本!$E$16*CF158,IF(OR(AI158=1,AI158=2),基本!$E$15*CF158)))","v":""},{"$f":"IF(AJ158=\"\",\"\",IF(AJ158>0,基本!$E$17*CF158))","v":""},{"$f":"IF(ER158=0,\"\",IF(AM158<=4,基本!$E$18*ER158,IF(AM158>4,基本!$E$19*ER158)))","v":""},{"$f":"IF(AC158=\"\",\"\",IF(AC158>=1,基本!$E$20))","v":""},0,"","","","","","","",null,null,null,null,null,null,null,null,null,null,null,null,null,null,null,null,null,null,null,null,null,null,null,null,null,null,null,null,null,null,null,null,null,null,null,null,null,null,null,null,null,null,null,null,null,null,null,null,null,null,null,null,null,"","","","","","","","","","","","","","","","","","","","","","","","","","","","","","","","","","","","","","",null,null,"","","","","","","","","","","","","","","","","","","","","","","","","","","","",""]
[150,null,null,null,null,null,null,null,null,null,null,null,null,null,null,null,null,null,null,null,null,null,null,null,null,null,null,null,null,null,null,null,null,null,null,null,null,null,null,null,null,null,null,null,null,null,null,null,null,null,null,null,null,null,null,null,null,null,null,null,null,null,null,null,null,null,null,null,null,null,null,null,null,null,null,null,null,null,null,null,null,null,null,0,"","","","","","","","","","","","","","","","","","","","","","","","","","","","","","","","","","",null,null,null,null,null,"","","","","","","","",null,null,null,null,null,"","","","","","","","","",null,null,0,{"$f":"IF(Z159<>\"新規\",\"\",IF(AI159=3,基本!$E$14,IF(OR(AI159=1,AI159=2),基本!$E$13,\"\")))","v":""},{"$f":"IF(CF159=0,\"\",IF(AI159=3,基本!$E$16*CF159,IF(OR(AI159=1,AI159=2),基本!$E$15*CF159)))","v":""},{"$f":"IF(AJ159=\"\",\"\",IF(AJ159>0,基本!$E$17*CF159))","v":""},{"$f":"IF(ER159=0,\"\",IF(AM159<=4,基本!$E$18*ER159,IF(AM159>4,基本!$E$19*ER159)))","v":""},{"$f":"IF(AC159=\"\",\"\",IF(AC159>=1,基本!$E$20))","v":""},0,"","","","","","","",null,null,null,null,null,null,null,null,null,null,null,null,null,null,null,null,null,null,null,null,null,null,null,null,null,null,null,null,null,null,null,null,null,null,null,null,null,null,null,null,null,null,null,null,null,null,null,null,null,null,null,null,null,"","","","","","","","","","","","","","","","","","","","","","","","","","","","","","","","","","","","","","",null,null,"","","","","","","","","","","","","","","","","","","","","","","","","","","","",""]
[151,null,null,null,null,null,null,null,null,null,null,null,null,null,null,null,null,null,null,null,null,null,null,null,null,null,null,null,null,null,null,null,null,null,null,null,null,null,null,null,null,null,null,null,null,null,null,null,null,null,null,null,null,null,null,null,null,null,null,null,null,null,null,null,null,null,null,null,null,null,null,null,null,null,null,null,null,null,null,null,null,null,null,0,"","","","","","","","","","","","","","","","","","","","","","","","","","","","","","","","","","",null,null,null,null,null,"","","","","","","","",null,null,null,null,null,"","","","","","","","","",null,null,0,{"$f":"IF(Z160<>\"新規\",\"\",IF(AI160=3,基本!$E$14,IF(OR(AI160=1,AI160=2),基本!$E$13,\"\")))","v":""},{"$f":"IF(CF160=0,\"\",IF(AI160=3,基本!$E$16*CF160,IF(OR(AI160=1,AI160=2),基本!$E$15*CF160)))","v":""},{"$f":"IF(AJ160=\"\",\"\",IF(AJ160>0,基本!$E$17*CF160))","v":""},{"$f":"IF(ER160=0,\"\",IF(AM160<=4,基本!$E$18*ER160,IF(AM160>4,基本!$E$19*ER160)))","v":""},{"$f":"IF(AC160=\"\",\"\",IF(AC160>=1,基本!$E$20))","v":""},0,"","","","","","","",null,null,null,null,null,null,null,null,null,null,null,null,null,null,null,null,null,null,null,null,null,null,null,null,null,null,null,null,null,null,null,null,null,null,null,null,null,null,null,null,null,null,null,null,null,null,null,null,null,null,null,null,null,"","","","","","","","","","","","","","","","","","","","","","","","","","","","","","","","","","","","","","",null,null,"","","","","","","","","","","","","","","","","","","","","","","","","","","","",""]
[152,null,null,null,null,null,null,null,null,null,null,null,null,null,null,null,null,null,null,null,null,null,null,null,null,null,null,null,null,null,null,null,null,null,null,null,null,null,null,null,null,null,null,null,null,null,null,null,null,null,null,null,null,null,null,null,null,null,null,null,null,null,null,null,null,null,null,null,null,null,null,null,null,null,null,null,null,null,null,null,null,null,null,0,"","","","","","","","","","","","","","","","","","","","","","","","","","","","","","","","","","",null,null,null,null,null,"","","","","","","","",null,null,null,null,null,"","","","","","","","","",null,null,0,{"$f":"IF(Z161<>\"新規\",\"\",IF(AI161=3,基本!$E$14,IF(OR(AI161=1,AI161=2),基本!$E$13,\"\")))","v":""},{"$f":"IF(CF161=0,\"\",IF(AI161=3,基本!$E$16*CF161,IF(OR(AI161=1,AI161=2),基本!$E$15*CF161)))","v":""},{"$f":"IF(AJ161=\"\",\"\",IF(AJ161>0,基本!$E$17*CF161))","v":""},{"$f":"IF(ER161=0,\"\",IF(AM161<=4,基本!$E$18*ER161,IF(AM161>4,基本!$E$19*ER161)))","v":""},{"$f":"IF(AC161=\"\",\"\",IF(AC161>=1,基本!$E$20))","v":""},0,"","","","","","","",null,null,null,null,null,null,null,null,null,null,null,null,null,null,null,null,null,null,null,null,null,null,null,null,null,null,null,null,null,null,null,null,null,null,null,null,null,null,null,null,null,null,null,null,null,null,null,null,null,null,null,null,null,"","","","","","","","","","","","","","","","","","","","","","","","","","","","","","","","","","","","","","",null,null,"","","","","","","","","","","","","","","","","","","","","","","","","","","","",""]
[153,null,null,null,null,null,null,null,null,null,null,null,null,null,null,null,null,null,null,null,null,null,null,null,null,null,null,null,null,null,null,null,null,null,null,null,null,null,null,null,null,null,null,null,null,null,null,null,null,null,null,null,null,null,null,null,null,null,null,null,null,null,null,null,null,null,null,null,null,null,null,null,null,null,null,null,null,null,null,null,null,null,null,0,"","","","","","","","","","","","","","","","","","","","","","","","","","","","","","","","","","",null,null,null,null,null,"","","","","","","","",null,null,null,null,null,"","","","","","","","","",null,null,0,{"$f":"IF(Z162<>\"新規\",\"\",IF(AI162=3,基本!$E$14,IF(OR(AI162=1,AI162=2),基本!$E$13,\"\")))","v":""},{"$f":"IF(CF162=0,\"\",IF(AI162=3,基本!$E$16*CF162,IF(OR(AI162=1,AI162=2),基本!$E$15*CF162)))","v":""},{"$f":"IF(AJ162=\"\",\"\",IF(AJ162>0,基本!$E$17*CF162))","v":""},{"$f":"IF(ER162=0,\"\",IF(AM162<=4,基本!$E$18*ER162,IF(AM162>4,基本!$E$19*ER162)))","v":""},{"$f":"IF(AC162=\"\",\"\",IF(AC162>=1,基本!$E$20))","v":""},0,"","","","","","","",null,null,null,null,null,null,null,null,null,null,null,null,null,null,null,null,null,null,null,null,null,null,null,null,null,null,null,null,null,null,null,null,null,null,null,null,null,null,null,null,null,null,null,null,null,null,null,null,null,null,null,null,null,"","","","","","","","","","","","","","","","","","","","","","","","","","","","","","","","","","","","","","",null,null,"","","","","","","","","","","","","","","","","","","","","","","","","","","","",""]
[154,null,null,null,null,null,null,null,null,null,null,null,null,null,null,null,null,null,null,null,null,null,null,null,null,null,null,null,null,null,null,null,null,null,null,null,null,null,null,null,null,null,null,null,null,null,null,null,null,null,null,null,null,null,null,null,null,null,null,null,null,null,null,null,null,null,null,null,null,null,null,null,null,null,null,null,null,null,null,null,null,null,null,{"$f":"COUNTA(BA163:CE163)","v":0},{"$f":"IF(K163=0,\"\",K163)","v":""},{"$f":"IF(G163=0,\"\",G163)","v":""},{"$f":"IF(LEN(CH163)=0,\"\",LEN(CH163))","v":""},{"$f":"IF(CI163=2,LEFT(CH163),\"\")","v":""},{"$f":"IF(CH163=\"\",\"\",RIGHT(CH163))","v":""},{"$f":"IF(H163=0,\"\",H163)","v":""},{"$f":"IF(LEN(CL163)=0,\"\",LEN(CL163))","v":""},{"$f":"IF(CM163=3,LEFT(CL163),\"\")","v":""},{"$f":"IF(CM163=3,MID(CL163,2,1),IF(CM163=2,LEFT(CL163),\"\"))","v":""},{"$f":"RIGHT(CL163)","v":""},{"$f":"IF(I163=0,\"\",I163)","v":""},{"$f":"IF(LEN(CQ163)=0,\"\",LEN(CQ163))","v":""},{"$f":"IF(CR163=7,LEFT(CQ163),\"\")","v":""},{"$f":"IF(CR163=6,MID(CQ163,2,1),IF(CR163=5,LEFT(CQ163),\"\"))","v":""},{"$f":"IF(CR163=6,MID(CQ163,3,1),IF(CR163=5,MID(CQ163,2,1),IF(CR163=4,LEFT(CQ163),\"\")))","v":""},{"$f":"IF(CR163=6,MID(CQ163,4,1),IF(CR163=5,MID(CQ163,3,1),IF(CR163=4,MID(CQ163,2,1),IF(CR163=3,LEFT(CQ163),\"\"))))","v":""},{"$f":"IF(CR163=6,MID(CQ163,5,1),IF(CR163=5,MID(CQ163,4,1),IF(CR163=4,MID(CQ163,3,1),IF(CR163=3,MID(CQ163,2,1),IF(CR163=2,LEFT(CQ163),\"\")))))","v":""},{"$f":"IF(RIGHT(CR163)=0,\"\",RIGHT(CQ163))","v":""},{"$f":"IF(T163=0,\"\",T163)","v":""},{"$f":"LEFT(CY163)","v":""},{"$f":"MID(CY163,2,2)","v":""},{"$f":"MID(CY163,5,2)","v":""},{"$f":"MID(CY163,8,2)","v":""},"",{"$f":"IF(DD163=\"\",\"\",DD163+DA163)","v":""},{"$f":"IF(DD163=\"\",\"\",DATE(DE163,DB163,DC163))","v":""},{"$f":"IF(DD163=\"\",\"\",DATEDIF(DF163,TODAY(),\"Y\"))","v":""},{"$f":"LEFT(DG163)","v":""},{"$f":"MID(DG163,2,1)","v":""},{"$f":"MID(DG163,3,1)","v":""},{"$f":"MID(DG163,5,1)","v":""},{"$f":"MID(DG163,6,1)","v":""},{"$f":"MID(DG163,7,1)","v":""},{"$f":"MID(DG163,8,1)","v":""},null,null,null,null,null,{"$f":"IF(Y163=0,\"\",Y163)","v":""},{"$f":"LEFT(DT163)","v":""},{"$f":"MID(DT163,2,2)","v":""},{"$f":"MID(DT163,5,2)","v":""},{"$f":"MID(DT163,8,2)","v":""},{"$f":"IF(DW163=\"\",\"\",VALUE(DW163))","v":""},{"$f":"IF(DV163=\"\",\"\",IF(VALUE(DV163)=$CW$6,IF(VALUE(DW163)=$CW$5,DX163,1),1))","v":""},{"$f":"IF(DV163=\"\",\"\",$CZ$5)","v":""},null,null,null,null,null,{"$f":"IF(DZ163=1,0,LEFT(DZ163))","v":""},{"$f":"IF(DZ163=1,1,RIGHT(DZ163))","v":""},{"$f":"LEFT(EA163)","v":""},{"$f":"MID(EA163,2,1)","v":""},{"$f":"IF(W163=0,\"\",W163)","v":""},{"$f":"IF(EK163=\"不詳\",\"\",IF(EK163=\"不明\",\"\",MID(EK163,2,2)))","v":""},{"$f":"MID(EK163,5,2)","v":""},{"$f":"MID(EK163,8,2)","v":""},{"$f":"LEFT(EK163)","v":""},null,null,{"$f":"COUNTIF(BA163:CE163,\"◎\")","v":0},{"$f":"IF(Z163<>\"新規\",\"\",IF(AI163=3,基本!$E$14,IF(OR(AI163=1,AI163=2),基本!$E$13,\"\")))","v":""},{"$f":"IF(CF163=0,\"\",IF(AI163=3,基本!$E$16*CF163,IF(OR(AI163=1,AI163=2),基本!$E$15*CF163)))","v":""},{"$f":"IF(AJ163=\"\",\"\",IF(AJ163>0,基本!$E$17*CF163))","v":""},{"$f":"IF(ER163=0,\"\",IF(AM163<=4,基本!$E$18*ER163,IF(AM163>4,基本!$E$19*ER163)))","v":""},{"$f":"IF(AC163=\"\",\"\",IF(AC163>=1,基本!$E$20))","v":""},{"$f":"SUM(ES163:EW163)","v":0},"","","","","","","",null,null,null,null,null,null,null,null,null,null,null,null,null,null,null,null,null,null,null,null,null,null,null,null,null,null,null,null,null,null,null,null,null,null,null,null,null,null,null,null,null,null,null,null,null,null,null,null,null,null,null,null,null,{"$f":"IF(AT163=0,\"\",AT163)","v":""},{"$f":"LEFT(HG163,1)","v":""},{"$f":"MID(HG163,2,2)","v":""},{"$f":"MID(HG163,5,2)","v":""},{"$f":"MID(HG163,8,2)","v":""},{"$f":"IF(LEFT(V163,3)=\"神経痛\",1,IF(LEFT(V163,3)=\"リウマ\",2,IF(LEFT(V163,3)=\"頚腕症\",3,IF(LEFT(V163,3)=\"五十肩\",4,IF(LEFT(V163,3)=\"腰痛症\",5,IF(LEFT(V163,3)=\"頚椎捻\",6,\"\"))))))","v":""},{"$f":"IF(OR(BA163=\"○\",BA163=\"◎\"),1,\"\")","v":""},{"$f":"IF(OR(BB163=\"○\",BB163=\"◎\"),2,\"\")","v":""},{"$f":"IF(OR(BC163=\"○\",BC163=\"◎\"),3,\"\")","v":""},{"$f":"IF(OR(BD163=\"○\",BD163=\"◎\"),4,\"\")","v":""},{"$f":"IF(OR(BE163=\"○\",BE163=\"◎\"),5,\"\")","v":""},{"$f":"IF(OR(BF163=\"○\",BF163=\"◎\"),6,\"\")","v":""},{"$f":"IF(OR(BG163=\"○\",BG163=\"◎\"),7,\"\")","v":""},{"$f":"IF(OR(BH163=\"○\",BH163=\"◎\"),8,\"\")","v":""},{"$f":"IF(OR(BI163=\"○\",BI163=\"◎\"),9,\"\")","v":""},{"$f":"IF(OR(BJ163=\"○\",BJ163=\"◎\"),10,\"\")","v":""},{"$f":"IF(OR(BK163=\"○\",BK163=\"◎\"),11,\"\")","v":""},{"$f":"IF(OR(BL163=\"○\",BL163=\"◎\"),12,\"\")","v":""},{"$f":"IF(OR(BM163=\"○\",BM163=\"◎\"),13,\"\")","v":""},{"$f":"IF(OR(BN163=\"○\",BN163=\"◎\"),14,\"\")","v":""},{"$f":"IF(OR(BO163=\"○\",BO163=\"◎\"),15,\"\")","v":""},{"$f":"IF(OR(BP163=\"○\",BP163=\"◎\"),16,\"\")","v":""},{"$f":"IF(OR(BQ163=\"○\",BQ163=\"◎\"),17,\"\")","v":""},{"$f":"IF(OR(BR163=\"○\",BR163=\"◎\"),18,\"\")","v":""},{"$f":"IF(OR(BS163=\"○\",BS163=\"◎\"),19,\"\")","v":""},{"$f":"IF(OR(BT163=\"○\",BT163=\"◎\"),20,\"\")","v":""},{"$f":"IF(OR(BU163=\"○\",BU163=\"◎\"),21,\"\")","v":""},{"$f":"IF(OR(BV163=\"○\",BV163=\"◎\"),22,\"\")","v":""},{"$f":"IF(OR(BW163=\"○\",BW163=\"◎\"),23,\"\")","v":""},{"$f":"IF(OR(BX163=\"○\",BX163=\"◎\"),24,\"\")","v":""},{"$f":"IF(OR(BY163=\"○\",BY163=\"◎\"),25,\"\")","v":""},{"$f":"IF(OR(BZ163=\"○\",BZ163=\"◎\"),26,\"\")","v":""},{"$f":"IF(OR(CA163=\"○\",CA163=\"◎\"),27,\"\")","v":""},{"$f":"IF(OR(CB163=\"○\",CB163=\"◎\"),28,\"\")","v":""},{"$f":"IF(OR(CC163=\"○\",CC163=\"◎\"),29,\"\")","v":""},{"$f":"IF(OR(CD163=\"○\",CD163=\"◎\"),30,\"\")","v":""},{"$f":"IF(OR(CE163=\"○\",CE163=\"◎\"),31,\"\")","v":""},{"$f":"IF(MAX(HM163:IQ163)=0,\"\",MAX(HM163:IQ163))","v":""},null,null,{"$f":"IF(G163=\"\",\"\",G163)","v":""},{"$f":"IF(LEN(IU163)=0,\"\",LEN(IU163))","v":""},{"$f":"IF(IV163=8,LEFT(IU163),\"\")","v":""},{"$f":"IF(IV163=8,MID(IU163,2,1),IF(IV163=7,LEFT(IU163),\"\"))","v":""},{"$f":"IF(IV163=8,MID(IU163,3,1),IF(IV163=7,MID(IU163,2,1),IF(IV163=6,LEFT(IU163),\"\")))","v":""},{"$f":"IF(IV163=8,MID(IU163,4,1),IF(IV163=7,MID(IU163,3,1),IF(IV163=6,MID(IU163,2,1),IF(IV163=5,LEFT(IU163),\"\"))))","v":""},{"$f":"IF(IV163=8,MID(IU163,5,1),IF(IV163=7,MID(IU163,4,1),IF(IV163=6,MID(IU163,3,1),IF(IV163=5,MID(IU163,2,1),IF(IV163=4,LEFT(IU163),\"\")))))","v":""},{"$f":"IF(IV163=8,MID(IU163,6,1),IF(IV163=7,MID(IU163,5,1),IF(IV163=6,MID(IU163,4,1),IF(IV163=5,MID(IU163,3,1),IF(IV163=4,MID(IU163,2,1),IF(IV163=3,LEFT(IU163),\"\"))))))","v":""},{"$f":"IF(IV163=8,MID(IU163,7,1),IF(IV163=7,MID(IU163,6,1),IF(IV163=6,MID(IU163,5,1),IF(IV163=5,MID(IU163,4,1),IF(IV163=4,MID(IU163,3,1),IF(IV163=3,MID(IU163,2,1),IF(IV163=2,LEFT(IU163),\"\")))))))","v":""},{"$f":"IF(RIGHT(IV163)=0,\"\",RIGHT(IU163))","v":""},{"$f":"IF(H163=\"\",\"\",H163)","v":""},{"$f":"IF(LEN(JE163)=0,\"\",LEN(JE163))","v":""},{"$f":"IF(JF163=7,LEFT(JE163),\"\")","v":""},{"$f":"IF(JF163=7,MID(JE163,2,1),IF(JF163=6,LEFT(JE163),\"\"))","v":""},{"$f":"IF(JF163=7,MID(JE163,3,1),IF(JF163=6,MID(JE163,2,1),IF(JF163=5,LEFT(JE163,1),\"\")))","v":""},{"$f":"IF(JF163=7,MID(JE163,4,1),IF(JF163=6,MID(JE163,3,1),IF(JF163=5,MID(JE163,2,1),IF(JF163=4,LEFT(JE163,1),\"\"))))","v":""},{"$f":"IF(JF163=7,MID(JE163,5,1),IF(JF163=6,MID(JE163,4,1),IF(JF163=5,MID(JE163,3,1),IF(JF163=4,MID(JE163,2,1),IF(JF163=3,LEFT(JE163,1),\"\")))))","v":""},{"$f":"IF(JF163=7,MID(JE163,6,1),IF(JF163=6,MID(JE163,5,1),IF(JF163=5,MID(JE163,4,1),IF(JF163=4,MID(JE163,3,1),IF(JF163=3,MID(JE163,2,1),\"\")))))","v":""},{"$f":"IF(RIGHT(JE163)=0,\"\",RIGHT(JE163))","v":""},{"$f":"IF(B163=\"\",\"\",B163)","v":""},{"$f":"IF(LEN(JN163)=0,\"\",LEN(JN163))","v":""},{"$f":"IF(JO163=8,LEFT(JN163),\"\")","v":""},{"$f":"IF(JO163=8,MID(JN163,2,1),IF(JO163=7,LEFT(JN163),\"\"))","v":""},{"$f":"IF(JO163=8,MID(JN163,3,1),IF(JO163=7,MID(JN163,2,1),IF(JO163=6,LEFT(JN163),\"\")))","v":""},{"$f":"IF(JO163=8,MID(JN163,4,1),IF(JO163=7,MID(JN163,3,1),IF(JO163=6,MID(JN163,2,1),IF(JO163=5,LEFT(JN163),\"\"))))","v":""},"",{"$f":"IF(JO163=8,MID(JN163,6,1),IF(JO163=7,MID(JN163,5,1),IF(JO163=6,MID(JN163,4,1),IF(JO163=5,MID(JN163,3,1),IF(JO163=4,MID(JN163,2,1),IF(JO163=3,LEFT(JN163),\"\"))))))","v":""},{"$f":"IF(JO163=8,MID(JN163,7,1),IF(JO163=7,MID(JN163,6,1),IF(JO163=6,MID(JN163,5,1),IF(JO163=5,MID(JN163,4,1),IF(JO163=4,MID(JN163,3,1),IF(JO163=3,MID(JN163,2,1),IF(JO163=2,LEFT(JN163),\"\")))))))","v":""},{"$f":"IF(RIGHT(JO163)=0,\"\",RIGHT(JN163))","v":""}]
[155,null,null,null,null,null,null,null,null,null,null,null,null,null,null,null,null,null,null,null,null,null,null,null,null,null,null,null,null,null,null,null,null,null,null,null,null,null,null,null,null,null,null,null,null,null,null,null,null,null,null,null,null,null,null,null,null,null,null,null,null,null,null,null,null,null,null,null,null,null,null,null,null,null,null,null,null,null,null,null,null,null,null,0,"","","","","","","","","","","","","","","","","","","","","","","","","","","","","","","","","","",null,null,null,null,null,"","","","","","","","",null,null,null,null,null,"","","","","","","","","",null,null,0,{"$f":"IF(Z164<>\"新規\",\"\",IF(AI164=3,基本!$E$14,IF(OR(AI164=1,AI164=2),基本!$E$13,\"\")))","v":""},{"$f":"IF(CF164=0,\"\",IF(AI164=3,基本!$E$16*CF164,IF(OR(AI164=1,AI164=2),基本!$E$15*CF164)))","v":""},{"$f":"IF(AJ164=\"\",\"\",IF(AJ164>0,基本!$E$17*CF164))","v":""},{"$f":"IF(ER164=0,\"\",IF(AM164<=4,基本!$E$18*ER164,IF(AM164>4,基本!$E$19*ER164)))","v":""},{"$f":"IF(AC164=\"\",\"\",IF(AC164>=1,基本!$E$20))","v":""},0,"","","","","","","",null,null,null,null,null,null,null,null,null,null,null,null,null,null,null,null,null,null,null,null,null,null,null,null,null,null,null,null,null,null,null,null,null,null,null,null,null,null,null,null,null,null,null,null,null,null,null,null,null,null,null,null,null,"","","","","","","","","","","","","","","","","","","","","","","","","","","","","","","","","","","","","","",null,null,"","","","","","","","","","","","","","","","","","","","","","","","","","","","",""]
[156,null,null,null,null,null,null,null,null,null,null,null,null,null,null,null,null,null,null,null,null,null,null,null,null,null,null,null,null,null,null,null,null,null,null,null,null,null,null,null,null,null,null,null,null,null,null,null,null,null,null,null,null,null,null,null,null,null,null,null,null,null,null,null,null,null,null,null,null,null,null,null,null,null,null,null,null,null,null,null,null,null,null,0,"","","","","","","","","","","","","","","","","","","","","","","","","","","","","","","","","","",null,null,null,null,null,"","","","","","","","",null,null,null,null,null,"","","","","","","","","",null,null,0,{"$f":"IF(Z165<>\"新規\",\"\",IF(AI165=3,基本!$E$14,IF(OR(AI165=1,AI165=2),基本!$E$13,\"\")))","v":""},{"$f":"IF(CF165=0,\"\",IF(AI165=3,基本!$E$16*CF165,IF(OR(AI165=1,AI165=2),基本!$E$15*CF165)))","v":""},{"$f":"IF(AJ165=\"\",\"\",IF(AJ165>0,基本!$E$17*CF165))","v":""},{"$f":"IF(ER165=0,\"\",IF(AM165<=4,基本!$E$18*ER165,IF(AM165>4,基本!$E$19*ER165)))","v":""},{"$f":"IF(AC165=\"\",\"\",IF(AC165>=1,基本!$E$20))","v":""},0,"","","","","","","",null,null,null,null,null,null,null,null,null,null,null,null,null,null,null,null,null,null,null,null,null,null,null,null,null,null,null,null,null,null,null,null,null,null,null,null,null,null,null,null,null,null,null,null,null,null,null,null,null,null,null,null,null,"","","","","","","","","","","","","","","","","","","","","","","","","","","","","","","","","","","","","","",null,null,"","","","","","","","","","","","","","","","","","","","","","","","","","","","",""]
[157,null,null,null,null,null,null,null,null,null,null,null,null,null,null,null,null,null,null,null,null,null,null,null,null,null,null,null,null,null,null,null,null,null,null,null,null,null,null,null,null,null,null,null,null,null,null,null,null,null,null,null,null,null,null,null,null,null,null,null,null,null,null,null,null,null,null,null,null,null,null,null,null,null,null,null,null,null,null,null,null,null,null,0,"","","","","","","","","","","","","","","","","","","","","","","","","","","","","","","","","","",null,null,null,null,null,"","","","","","","","",null,null,null,null,null,"","","","","","","","","",null,null,0,{"$f":"IF(Z166<>\"新規\",\"\",IF(AI166=3,基本!$E$14,IF(OR(AI166=1,AI166=2),基本!$E$13,\"\")))","v":""},{"$f":"IF(CF166=0,\"\",IF(AI166=3,基本!$E$16*CF166,IF(OR(AI166=1,AI166=2),基本!$E$15*CF166)))","v":""},{"$f":"IF(AJ166=\"\",\"\",IF(AJ166>0,基本!$E$17*CF166))","v":""},{"$f":"IF(ER166=0,\"\",IF(AM166<=4,基本!$E$18*ER166,IF(AM166>4,基本!$E$19*ER166)))","v":""},{"$f":"IF(AC166=\"\",\"\",IF(AC166>=1,基本!$E$20))","v":""},0,"","","","","","","",null,null,null,null,null,null,null,null,null,null,null,null,null,null,null,null,null,null,null,null,null,null,null,null,null,null,null,null,null,null,null,null,null,null,null,null,null,null,null,null,null,null,null,null,null,null,null,null,null,null,null,null,null,"","","","","","","","","","","","","","","","","","","","","","","","","","","","","","","","","","","","","","",null,null,"","","","","","","","","","","","","","","","","","","","","","","","","","","","",""]
[158,null,null,null,null,null,null,null,null,null,null,null,null,null,null,null,null,null,null,null,null,null,null,null,null,null,null,null,null,null,null,null,null,null,null,null,null,null,null,null,null,null,null,null,null,null,null,null,null,null,null,null,null,null,null,null,null,null,null,null,null,null,null,null,null,null,null,null,null,null,null,null,null,null,null,null,null,null,null,null,null,null,null,0,"","","","","","","","","","","","","","","","","","","","","","","","","","","","","","","","","","",null,null,null,null,null,"","","","","","","","",null,null,null,null,null,"","","","","","","","","",null,null,0,{"$f":"IF(Z167<>\"新規\",\"\",IF(AI167=3,基本!$E$14,IF(OR(AI167=1,AI167=2),基本!$E$13,\"\")))","v":""},{"$f":"IF(CF167=0,\"\",IF(AI167=3,基本!$E$16*CF167,IF(OR(AI167=1,AI167=2),基本!$E$15*CF167)))","v":""},{"$f":"IF(AJ167=\"\",\"\",IF(AJ167>0,基本!$E$17*CF167))","v":""},{"$f":"IF(ER167=0,\"\",IF(AM167<=4,基本!$E$18*ER167,IF(AM167>4,基本!$E$19*ER167)))","v":""},{"$f":"IF(AC167=\"\",\"\",IF(AC167>=1,基本!$E$20))","v":""},0,"","","","","","","",null,null,null,null,null,null,null,null,null,null,null,null,null,null,null,null,null,null,null,null,null,null,null,null,null,null,null,null,null,null,null,null,null,null,null,null,null,null,null,null,null,null,null,null,null,null,null,null,null,null,null,null,null,"","","","","","","","","","","","","","","","","","","","","","","","","","","","","","","","","","","","","","",null,null,"","","","","","","","","","","","","","","","","","","","","","","","","","","","",""]
[159,null,null,null,null,null,null,null,null,null,null,null,null,null,null,null,null,null,null,null,null,null,null,null,null,null,null,null,null,null,null,null,null,null,null,null,null,null,null,null,null,null,null,null,null,null,null,null,null,null,null,null,null,null,null,null,null,null,null,null,null,null,null,null,null,null,null,null,null,null,null,null,null,null,null,null,null,null,null,null,null,null,null,0,"","","","","","","","","","","","","","","","","","","","","","","","","","","","","","","","","","",null,null,null,null,null,"","","","","","","","",null,null,null,null,null,"","","","","","","","","",null,null,0,{"$f":"IF(Z168<>\"新規\",\"\",IF(AI168=3,基本!$E$14,IF(OR(AI168=1,AI168=2),基本!$E$13,\"\")))","v":""},{"$f":"IF(CF168=0,\"\",IF(AI168=3,基本!$E$16*CF168,IF(OR(AI168=1,AI168=2),基本!$E$15*CF168)))","v":""},{"$f":"IF(AJ168=\"\",\"\",IF(AJ168>0,基本!$E$17*CF168))","v":""},{"$f":"IF(ER168=0,\"\",IF(AM168<=4,基本!$E$18*ER168,IF(AM168>4,基本!$E$19*ER168)))","v":""},{"$f":"IF(AC168=\"\",\"\",IF(AC168>=1,基本!$E$20))","v":""},0,"","","","","","","",null,null,null,null,null,null,null,null,null,null,null,null,null,null,null,null,null,null,null,null,null,null,null,null,null,null,null,null,null,null,null,null,null,null,null,null,null,null,null,null,null,null,null,null,null,null,null,null,null,null,null,null,null,"","","","","","","","","","","","","","","","","","","","","","","","","","","","","","","","","","","","","","",null,null,"","","","","","","","","","","","","","","","","","","","","","","","","","","","",""]
[160,null,null,null,null,null,null,null,null,null,null,null,null,null,null,null,null,null,null,null,null,null,null,null,null,null,null,null,null,null,null,null,null,null,null,null,null,null,null,null,null,null,null,null,null,null,null,null,null,null,null,null,null,null,null,null,null,null,null,null,null,null,null,null,null,null,null,null,null,null,null,null,null,null,null,null,null,null,null,null,null,null,null,0,"","","","","","","","","","","","","","","","","","","","","","","","","","","","","","","","","","",null,null,null,null,null,"","","","","","","","",null,null,null,null,null,"","","","","","","","","",null,null,0,{"$f":"IF(Z169<>\"新規\",\"\",IF(AI169=3,基本!$E$14,IF(OR(AI169=1,AI169=2),基本!$E$13,\"\")))","v":""},{"$f":"IF(CF169=0,\"\",IF(AI169=3,基本!$E$16*CF169,IF(OR(AI169=1,AI169=2),基本!$E$15*CF169)))","v":""},{"$f":"IF(AJ169=\"\",\"\",IF(AJ169>0,基本!$E$17*CF169))","v":""},{"$f":"IF(ER169=0,\"\",IF(AM169<=4,基本!$E$18*ER169,IF(AM169>4,基本!$E$19*ER169)))","v":""},{"$f":"IF(AC169=\"\",\"\",IF(AC169>=1,基本!$E$20))","v":""},0,"","","","","","","",null,null,null,null,null,null,null,null,null,null,null,null,null,null,null,null,null,null,null,null,null,null,null,null,null,null,null,null,null,null,null,null,null,null,null,null,null,null,null,null,null,null,null,null,null,null,null,null,null,null,null,null,null,"","","","","","","","","","","","","","","","","","","","","","","","","","","","","","","","","","","","","","",null,null,"","","","","","","","","","","","","","","","","","","","","","","","","","","","",""]
[161,null,null,null,null,null,null,null,null,null,null,null,null,null,null,null,null,null,null,null,null,null,null,null,null,null,null,null,null,null,null,null,null,null,null,null,null,null,null,null,null,null,null,null,null,null,null,null,null,null,null,null,null,null,null,null,null,null,null,null,null,null,null,null,null,null,null,null,null,null,null,null,null,null,null,null,null,null,null,null,null,null,null,0,"","","","","","","","","","","","","","","","","","","","","","","","","","","","","","","","","","",null,null,null,null,null,"","","","","","","","",null,null,null,null,null,"","","","","","","","","",null,null,0,{"$f":"IF(Z170<>\"新規\",\"\",IF(AI170=3,基本!$E$14,IF(OR(AI170=1,AI170=2),基本!$E$13,\"\")))","v":""},{"$f":"IF(CF170=0,\"\",IF(AI170=3,基本!$E$16*CF170,IF(OR(AI170=1,AI170=2),基本!$E$15*CF170)))","v":""},{"$f":"IF(AJ170=\"\",\"\",IF(AJ170>0,基本!$E$17*CF170))","v":""},{"$f":"IF(ER170=0,\"\",IF(AM170<=4,基本!$E$18*ER170,IF(AM170>4,基本!$E$19*ER170)))","v":""},{"$f":"IF(AC170=\"\",\"\",IF(AC170>=1,基本!$E$20))","v":""},0,"","","","","","","",null,null,null,null,null,null,null,null,null,null,null,null,null,null,null,null,null,null,null,null,null,null,null,null,null,null,null,null,null,null,null,null,null,null,null,null,null,null,null,null,null,null,null,null,null,null,null,null,null,null,null,null,null,"","","","","","","","","","","","","","","","","","","","","","","","","","","","","","","","","","","","","","",null,null,"","","","","","","","","","","","","","","","","","","","","","","","","","","","",""]
[162,null,null,null,null,null,null,null,null,null,null,null,null,null,null,null,null,null,null,null,null,null,null,null,null,null,null,null,null,null,null,null,null,null,null,null,null,null,null,null,null,null,null,null,null,null,null,null,null,null,null,null,null,null,null,null,null,null,null,null,null,null,null,null,null,null,null,null,null,null,null,null,null,null,null,null,null,null,null,null,null,null,null,0,"","","","","","","","","","","","","","","","","","","","","","","","","","","","","","","","","","",null,null,null,null,null,"","","","","","","","",null,null,null,null,null,"","","","","","","","","",null,null,0,{"$f":"IF(Z171<>\"新規\",\"\",IF(AI171=3,基本!$E$14,IF(OR(AI171=1,AI171=2),基本!$E$13,\"\")))","v":""},{"$f":"IF(CF171=0,\"\",IF(AI171=3,基本!$E$16*CF171,IF(OR(AI171=1,AI171=2),基本!$E$15*CF171)))","v":""},{"$f":"IF(AJ171=\"\",\"\",IF(AJ171>0,基本!$E$17*CF171))","v":""},{"$f":"IF(ER171=0,\"\",IF(AM171<=4,基本!$E$18*ER171,IF(AM171>4,基本!$E$19*ER171)))","v":""},{"$f":"IF(AC171=\"\",\"\",IF(AC171>=1,基本!$E$20))","v":""},0,"","","","","","","",null,null,null,null,null,null,null,null,null,null,null,null,null,null,null,null,null,null,null,null,null,null,null,null,null,null,null,null,null,null,null,null,null,null,null,null,null,null,null,null,null,null,null,null,null,null,null,null,null,null,null,null,null,"","","","","","","","","","","","","","","","","","","","","","","","","","","","","","","","","","","","","","",null,null,"","","","","","","","","","","","","","","","","","","","","","","","","","","","",""]
[163,null,null,null,null,null,null,null,null,null,null,null,null,null,null,null,null,null,null,null,null,null,null,null,null,null,null,null,null,null,null,null,null,null,null,null,null,null,null,null,null,null,null,null,null,null,null,null,null,null,null,null,null,null,null,null,null,null,null,null,null,null,null,null,null,null,null,null,null,null,null,null,null,null,null,null,null,null,null,null,null,null,null,0,"","","","","","","","","","","","","","","","","","","","","","","","","","","","","","","","","","",null,null,null,null,null,"","","","","","","","",null,null,null,null,null,"","","","","","","","","",null,null,0,{"$f":"IF(Z172<>\"新規\",\"\",IF(AI172=3,基本!$E$14,IF(OR(AI172=1,AI172=2),基本!$E$13,\"\")))","v":""},{"$f":"IF(CF172=0,\"\",IF(AI172=3,基本!$E$16*CF172,IF(OR(AI172=1,AI172=2),基本!$E$15*CF172)))","v":""},{"$f":"IF(AJ172=\"\",\"\",IF(AJ172>0,基本!$E$17*CF172))","v":""},{"$f":"IF(ER172=0,\"\",IF(AM172<=4,基本!$E$18*ER172,IF(AM172>4,基本!$E$19*ER172)))","v":""},{"$f":"IF(AC172=\"\",\"\",IF(AC172>=1,基本!$E$20))","v":""},0,"","","","","","","",null,null,null,null,null,null,null,null,null,null,null,null,null,null,null,null,null,null,null,null,null,null,null,null,null,null,null,null,null,null,null,null,null,null,null,null,null,null,null,null,null,null,null,null,null,null,null,null,null,null,null,null,null,"","","","","","","","","","","","","","","","","","","","","","","","","","","","","","","","","","","","","","",null,null,"","","","","","","","","","","","","","","","","","","","","","","","","","","","",""]
[164,null,null,null,null,null,null,null,null,null,null,null,null,null,null,null,null,null,null,null,null,null,null,null,null,null,null,null,null,null,null,null,null,null,null,null,null,null,null,null,null,null,null,null,null,null,null,null,null,null,null,null,null,null,null,null,null,null,null,null,null,null,null,null,null,null,null,null,null,null,null,null,null,null,null,null,null,null,null,null,null,null,null,0,"","","","","","","","","","","","","","","","","","","","","","","","","","","","","","","","","","",null,null,null,null,null,"","","","","","","","",null,null,null,null,null,"","","","","","","","","",null,null,0,{"$f":"IF(Z173<>\"新規\",\"\",IF(AI173=3,基本!$E$14,IF(OR(AI173=1,AI173=2),基本!$E$13,\"\")))","v":""},{"$f":"IF(CF173=0,\"\",IF(AI173=3,基本!$E$16*CF173,IF(OR(AI173=1,AI173=2),基本!$E$15*CF173)))","v":""},{"$f":"IF(AJ173=\"\",\"\",IF(AJ173>0,基本!$E$17*CF173))","v":""},{"$f":"IF(ER173=0,\"\",IF(AM173<=4,基本!$E$18*ER173,IF(AM173>4,基本!$E$19*ER173)))","v":""},{"$f":"IF(AC173=\"\",\"\",IF(AC173>=1,基本!$E$20))","v":""},0,"","","","","","","",null,null,null,null,null,null,null,null,null,null,null,null,null,null,null,null,null,null,null,null,null,null,null,null,null,null,null,null,null,null,null,null,null,null,null,null,null,null,null,null,null,null,null,null,null,null,null,null,null,null,null,null,null,"","","","","","","","","","","","","","","","","","","","","","","","","","","","","","","","","","","","","","",null,null,"","","","","","","","","","","","","","","","","","","","","","","","","","","","",""]
[165,null,null,null,null,null,null,null,null,null,null,null,null,null,null,null,null,null,null,null,null,null,null,null,null,null,null,null,null,null,null,null,null,null,null,null,null,null,null,null,null,null,null,null,null,null,null,null,null,null,null,null,null,null,null,null,null,null,null,null,null,null,null,null,null,null,null,null,null,null,null,null,null,null,null,null,null,null,null,null,null,null,null,0,"","","","","","","","","","","","","","","","","","","","","","","","","","","","","","","","","","",null,null,null,null,null,"","","","","","","","",null,null,null,null,null,"","","","","","","","","",null,null,0,{"$f":"IF(Z174<>\"新規\",\"\",IF(AI174=3,基本!$E$14,IF(OR(AI174=1,AI174=2),基本!$E$13,\"\")))","v":""},{"$f":"IF(CF174=0,\"\",IF(AI174=3,基本!$E$16*CF174,IF(OR(AI174=1,AI174=2),基本!$E$15*CF174)))","v":""},{"$f":"IF(AJ174=\"\",\"\",IF(AJ174>0,基本!$E$17*CF174))","v":""},{"$f":"IF(ER174=0,\"\",IF(AM174<=4,基本!$E$18*ER174,IF(AM174>4,基本!$E$19*ER174)))","v":""},{"$f":"IF(AC174=\"\",\"\",IF(AC174>=1,基本!$E$20))","v":""},0,"","","","","","","",null,null,null,null,null,null,null,null,null,null,null,null,null,null,null,null,null,null,null,null,null,null,null,null,null,null,null,null,null,null,null,null,null,null,null,null,null,null,null,null,null,null,null,null,null,null,null,null,null,null,null,null,null,"","","","","","","","","","","","","","","","","","","","","","","","","","","","","","","","","","","","","","",null,null,"","","","","","","","","","","","","","","","","","","","","","","","","","","","",""]
[166,null,null,null,null,null,null,null,null,null,null,null,null,null,null,null,null,null,null,null,null,null,null,null,null,null,null,null,null,null,null,null,null,null,null,null,null,null,null,null,null,null,null,null,null,null,null,null,null,null,null,null,null,null,null,null,null,null,null,null,null,null,null,null,null,null,null,null,null,null,null,null,null,null,null,null,null,null,null,null,null,null,null,0,"","","","","","","","","","","","","","","","","","","","","","","","","","","","","","","","","","",null,null,null,null,null,"","","","","","","","",null,null,null,null,null,"","","","","","","","","",null,null,0,{"$f":"IF(Z175<>\"新規\",\"\",IF(AI175=3,基本!$E$14,IF(OR(AI175=1,AI175=2),基本!$E$13,\"\")))","v":""},{"$f":"IF(CF175=0,\"\",IF(AI175=3,基本!$E$16*CF175,IF(OR(AI175=1,AI175=2),基本!$E$15*CF175)))","v":""},{"$f":"IF(AJ175=\"\",\"\",IF(AJ175>0,基本!$E$17*CF175))","v":""},{"$f":"IF(ER175=0,\"\",IF(AM175<=4,基本!$E$18*ER175,IF(AM175>4,基本!$E$19*ER175)))","v":""},{"$f":"IF(AC175=\"\",\"\",IF(AC175>=1,基本!$E$20))","v":""},0,"","","","","","","",null,null,null,null,null,null,null,null,null,null,null,null,null,null,null,null,null,null,null,null,null,null,null,null,null,null,null,null,null,null,null,null,null,null,null,null,null,null,null,null,null,null,null,null,null,null,null,null,null,null,null,null,null,"","","","","","","","","","","","","","","","","","","","","","","","","","","","","","","","","","","","","","",null,null,"","","","","","","","","","","","","","","","","","","","","","","","","","","","",""]
[167,null,null,null,null,null,null,null,null,null,null,null,null,null,null,null,null,null,null,null,null,null,null,null,null,null,null,null,null,null,null,null,null,null,null,null,null,null,null,null,null,null,null,null,null,null,null,null,null,null,null,null,null,null,null,null,null,null,null,null,null,null,null,null,null,null,null,null,null,null,null,null,null,null,null,null,null,null,null,null,null,null,null,0,"","","","","","","","","","","","","","","","","","","","","","","","","","","","","","","","","","",null,null,null,null,null,"","","","","","","","",null,null,null,null,null,"","","","","","","","","",null,null,0,{"$f":"IF(Z176<>\"新規\",\"\",IF(AI176=3,基本!$E$14,IF(OR(AI176=1,AI176=2),基本!$E$13,\"\")))","v":""},{"$f":"IF(CF176=0,\"\",IF(AI176=3,基本!$E$16*CF176,IF(OR(AI176=1,AI176=2),基本!$E$15*CF176)))","v":""},{"$f":"IF(AJ176=\"\",\"\",IF(AJ176>0,基本!$E$17*CF176))","v":""},{"$f":"IF(ER176=0,\"\",IF(AM176<=4,基本!$E$18*ER176,IF(AM176>4,基本!$E$19*ER176)))","v":""},{"$f":"IF(AC176=\"\",\"\",IF(AC176>=1,基本!$E$20))","v":""},0,"","","","","","","",null,null,null,null,null,null,null,null,null,null,null,null,null,null,null,null,null,null,null,null,null,null,null,null,null,null,null,null,null,null,null,null,null,null,null,null,null,null,null,null,null,null,null,null,null,null,null,null,null,null,null,null,null,"","","","","","","","","","","","","","","","","","","","","","","","","","","","","","","","","","","","","","",null,null,"","","","","","","","","","","","","","","","","","","","","","","","","","","","",""]
[168,null,null,null,null,null,null,null,null,null,null,null,null,null,null,null,null,null,null,null,null,null,null,null,null,null,null,null,null,null,null,null,null,null,null,null,null,null,null,null,null,null,null,null,null,null,null,null,null,null,null,null,null,null,null,null,null,null,null,null,null,null,null,null,null,null,null,null,null,null,null,null,null,null,null,null,null,null,null,null,null,null,null,0,"","","","","","","","","","","","","","","","","","","","","","","","","","","","","","","","","","",null,null,null,null,null,"","","","","","","","",null,null,null,null,null,"","","","","","","","","",null,null,0,{"$f":"IF(Z177<>\"新規\",\"\",IF(AI177=3,基本!$E$14,IF(OR(AI177=1,AI177=2),基本!$E$13,\"\")))","v":""},{"$f":"IF(CF177=0,\"\",IF(AI177=3,基本!$E$16*CF177,IF(OR(AI177=1,AI177=2),基本!$E$15*CF177)))","v":""},{"$f":"IF(AJ177=\"\",\"\",IF(AJ177>0,基本!$E$17*CF177))","v":""},{"$f":"IF(ER177=0,\"\",IF(AM177<=4,基本!$E$18*ER177,IF(AM177>4,基本!$E$19*ER177)))","v":""},{"$f":"IF(AC177=\"\",\"\",IF(AC177>=1,基本!$E$20))","v":""},0,"","","","","","","",null,null,null,null,null,null,null,null,null,null,null,null,null,null,null,null,null,null,null,null,null,null,null,null,null,null,null,null,null,null,null,null,null,null,null,null,null,null,null,null,null,null,null,null,null,null,null,null,null,null,null,null,null,"","","","","","","","","","","","","","","","","","","","","","","","","","","","","","","","","","","","","","",null,null,"","","","","","","","","","","","","","","","","","","","","","","","","","","","",""]
[169,null,null,null,null,null,null,null,null,null,null,null,null,null,null,null,null,null,null,null,null,null,null,null,null,null,null,null,null,null,null,null,null,null,null,null,null,null,null,null,null,null,null,null,null,null,null,null,null,null,null,null,null,null,null,null,null,null,null,null,null,null,null,null,null,null,null,null,null,null,null,null,null,null,null,null,null,null,null,null,null,null,null,0,"","","","","","","","","","","","","","","","","","","","","","","","","","","","","","","","","","",null,null,null,null,null,"","","","","","","","",null,null,null,null,null,"","","","","","","","","",null,null,0,{"$f":"IF(Z178<>\"新規\",\"\",IF(AI178=3,基本!$E$14,IF(OR(AI178=1,AI178=2),基本!$E$13,\"\")))","v":""},{"$f":"IF(CF178=0,\"\",IF(AI178=3,基本!$E$16*CF178,IF(OR(AI178=1,AI178=2),基本!$E$15*CF178)))","v":""},{"$f":"IF(AJ178=\"\",\"\",IF(AJ178>0,基本!$E$17*CF178))","v":""},{"$f":"IF(ER178=0,\"\",IF(AM178<=4,基本!$E$18*ER178,IF(AM178>4,基本!$E$19*ER178)))","v":""},{"$f":"IF(AC178=\"\",\"\",IF(AC178>=1,基本!$E$20))","v":""},0,"","","","","","","",null,null,null,null,null,null,null,null,null,null,null,null,null,null,null,null,null,null,null,null,null,null,null,null,null,null,null,null,null,null,null,null,null,null,null,null,null,null,null,null,null,null,null,null,null,null,null,null,null,null,null,null,null,"","","","","","","","","","","","","","","","","","","","","","","","","","","","","","","","","","","","","","",null,null,"","","","","","","","","","","","","","","","","","","","","","","","","","","","",""]
[170,null,null,null,null,null,null,null,null,null,null,null,null,null,null,null,null,null,null,null,null,null,null,null,null,null,null,null,null,null,null,null,null,null,null,null,null,null,null,null,null,null,null,null,null,null,null,null,null,null,null,null,null,null,null,null,null,null,null,null,null,null,null,null,null,null,null,null,null,null,null,null,null,null,null,null,null,null,null,null,null,null,null,0,"","","","","","","","","","","","","","","","","","","","","","","","","","","","","","","","","","",null,null,null,null,null,"","","","","","","","",null,null,null,null,null,"","","","","","","","","",null,null,0,{"$f":"IF(Z179<>\"新規\",\"\",IF(AI179=3,基本!$E$14,IF(OR(AI179=1,AI179=2),基本!$E$13,\"\")))","v":""},{"$f":"IF(CF179=0,\"\",IF(AI179=3,基本!$E$16*CF179,IF(OR(AI179=1,AI179=2),基本!$E$15*CF179)))","v":""},{"$f":"IF(AJ179=\"\",\"\",IF(AJ179>0,基本!$E$17*CF179))","v":""},{"$f":"IF(ER179=0,\"\",IF(AM179<=4,基本!$E$18*ER179,IF(AM179>4,基本!$E$19*ER179)))","v":""},{"$f":"IF(AC179=\"\",\"\",IF(AC179>=1,基本!$E$20))","v":""},0,"","","","","","","",null,null,null,null,null,null,null,null,null,null,null,null,null,null,null,null,null,null,null,null,null,null,null,null,null,null,null,null,null,null,null,null,null,null,null,null,null,null,null,null,null,null,null,null,null,null,null,null,null,null,null,null,null,"","","","","","","","","","","","","","","","","","","","","","","","","","","","","","","","","","","","","","",null,null,"","","","","","","","","","","","","","","","","","","","","","","","","","","","",""]
[171,null,null,null,null,null,null,null,null,null,null,null,null,null,null,null,null,null,null,null,null,null,null,null,null,null,null,null,null,null,null,null,null,null,null,null,null,null,null,null,null,null,null,null,null,null,null,null,null,null,null,null,null,null,null,null,null,null,null,null,null,null,null,null,null,null,null,null,null,null,null,null,null,null,null,null,null,null,null,null,null,null,null,0,"","","","","","","","","","","","","","","","","","","","","","","","","","","","","","","","","","",null,null,null,null,null,"","","","","","","","",null,null,null,null,null,"","","","","","","","","",null,null,0,{"$f":"IF(Z180<>\"新規\",\"\",IF(AI180=3,基本!$E$14,IF(OR(AI180=1,AI180=2),基本!$E$13,\"\")))","v":""},{"$f":"IF(CF180=0,\"\",IF(AI180=3,基本!$E$16*CF180,IF(OR(AI180=1,AI180=2),基本!$E$15*CF180)))","v":""},{"$f":"IF(AJ180=\"\",\"\",IF(AJ180>0,基本!$E$17*CF180))","v":""},{"$f":"IF(ER180=0,\"\",IF(AM180<=4,基本!$E$18*ER180,IF(AM180>4,基本!$E$19*ER180)))","v":""},{"$f":"IF(AC180=\"\",\"\",IF(AC180>=1,基本!$E$20))","v":""},0,"","","","","","","",null,null,null,null,null,null,null,null,null,null,null,null,null,null,null,null,null,null,null,null,null,null,null,null,null,null,null,null,null,null,null,null,null,null,null,null,null,null,null,null,null,null,null,null,null,null,null,null,null,null,null,null,null,"","","","","","","","","","","","","","","","","","","","","","","","","","","","","","","","","","","","","","",null,null,"","","","","","","","","","","","","","","","","","","","","","","","","","","","",""]
[172,null,null,null,null,null,null,null,null,null,null,null,null,null,null,null,null,null,null,null,null,null,null,null,null,null,null,null,null,null,null,null,null,null,null,null,null,null,null,null,null,null,null,null,null,null,null,null,null,null,null,null,null,null,null,null,null,null,null,null,null,null,null,null,null,null,null,null,null,null,null,null,null,null,null,null,null,null,null,null,null,null,null,0,"","","","","","","","","","","","","","","","","","","","","","","","","","","","","","","","","","",null,null,null,null,null,"","","","","","","","",null,null,null,null,null,"","","","","","","","","",null,null,0,{"$f":"IF(Z181<>\"新規\",\"\",IF(AI181=3,基本!$E$14,IF(OR(AI181=1,AI181=2),基本!$E$13,\"\")))","v":""},{"$f":"IF(CF181=0,\"\",IF(AI181=3,基本!$E$16*CF181,IF(OR(AI181=1,AI181=2),基本!$E$15*CF181)))","v":""},{"$f":"IF(AJ181=\"\",\"\",IF(AJ181>0,基本!$E$17*CF181))","v":""},{"$f":"IF(ER181=0,\"\",IF(AM181<=4,基本!$E$18*ER181,IF(AM181>4,基本!$E$19*ER181)))","v":""},{"$f":"IF(AC181=\"\",\"\",IF(AC181>=1,基本!$E$20))","v":""},0,"","","","","","","",null,null,null,null,null,null,null,null,null,null,null,null,null,null,null,null,null,null,null,null,null,null,null,null,null,null,null,null,null,null,null,null,null,null,null,null,null,null,null,null,null,null,null,null,null,null,null,null,null,null,null,null,null,"","","","","","","","","","","","","","","","","","","","","","","","","","","","","","","","","","","","","","",null,null,"","","","","","","","","","","","","","","","","","","","","","","","","","","","",""]
[173,null,null,null,null,null,null,null,null,null,null,null,null,null,null,null,null,null,null,null,null,null,null,null,null,null,null,null,null,null,null,null,null,null,null,null,null,null,null,null,null,null,null,null,null,null,null,null,null,null,null,null,null,null,null,null,null,null,null,null,null,null,null,null,null,null,null,null,null,null,null,null,null,null,null,null,null,null,null,null,null,null,null,0,"","","","","","","","","","","","","","","","","","","","","","","","","","","","","","","","","","",null,null,null,null,null,"","","","","","","","",null,null,null,null,null,"","","","","","","","","",null,null,0,{"$f":"IF(Z182<>\"新規\",\"\",IF(AI182=3,基本!$E$14,IF(OR(AI182=1,AI182=2),基本!$E$13,\"\")))","v":""},{"$f":"IF(CF182=0,\"\",IF(AI182=3,基本!$E$16*CF182,IF(OR(AI182=1,AI182=2),基本!$E$15*CF182)))","v":""},{"$f":"IF(AJ182=\"\",\"\",IF(AJ182>0,基本!$E$17*CF182))","v":""},{"$f":"IF(ER182=0,\"\",IF(AM182<=4,基本!$E$18*ER182,IF(AM182>4,基本!$E$19*ER182)))","v":""},{"$f":"IF(AC182=\"\",\"\",IF(AC182>=1,基本!$E$20))","v":""},0,"","","","","","","",null,null,null,null,null,null,null,null,null,null,null,null,null,null,null,null,null,null,null,null,null,null,null,null,null,null,null,null,null,null,null,null,null,null,null,null,null,null,null,null,null,null,null,null,null,null,null,null,null,null,null,null,null,"","","","","","","","","","","","","","","","","","","","","","","","","","","","","","","","","","","","","","",null,null,"","","","","","","","","","","","","","","","","","","","","","","","","","","","",""]
[174,null,null,null,null,null,null,null,null,null,null,null,null,null,null,null,null,null,null,null,null,null,null,null,null,null,null,null,null,null,null,null,null,null,null,null,null,null,null,null,null,null,null,null,null,null,null,null,null,null,null,null,null,null,null,null,null,null,null,null,null,null,null,null,null,null,null,null,null,null,null,null,null,null,null,null,null,null,null,null,null,null,null,0,"","","","","","","","","","","","","","","","","","","","","","","","","","","","","","","","","","",null,null,null,null,null,"","","","","","","","",null,null,null,null,null,"","","","","","","","","",null,null,0,{"$f":"IF(Z183<>\"新規\",\"\",IF(AI183=3,基本!$E$14,IF(OR(AI183=1,AI183=2),基本!$E$13,\"\")))","v":""},{"$f":"IF(CF183=0,\"\",IF(AI183=3,基本!$E$16*CF183,IF(OR(AI183=1,AI183=2),基本!$E$15*CF183)))","v":""},{"$f":"IF(AJ183=\"\",\"\",IF(AJ183>0,基本!$E$17*CF183))","v":""},{"$f":"IF(ER183=0,\"\",IF(AM183<=4,基本!$E$18*ER183,IF(AM183>4,基本!$E$19*ER183)))","v":""},{"$f":"IF(AC183=\"\",\"\",IF(AC183>=1,基本!$E$20))","v":""},0,"","","","","","","",null,null,null,null,null,null,null,null,null,null,null,null,null,null,null,null,null,null,null,null,null,null,null,null,null,null,null,null,null,null,null,null,null,null,null,null,null,null,null,null,null,null,null,null,null,null,null,null,null,null,null,null,null,"","","","","","","","","","","","","","","","","","","","","","","","","","","","","","","","","","","","","","",null,null,"","","","","","","","","","","","","","","","","","","","","","","","","","","","",""]
[175,null,null,null,null,null,null,null,null,null,null,null,null,null,null,null,null,null,null,null,null,null,null,null,null,null,null,null,null,null,null,null,null,null,null,null,null,null,null,null,null,null,null,null,null,null,null,null,null,null,null,null,null,null,null,null,null,null,null,null,null,null,null,null,null,null,null,null,null,null,null,null,null,null,null,null,null,null,null,null,null,null,null,0,"","","","","","","","","","","","","","","","","","","","","","","","","","","","","","","","","","",null,null,null,null,null,"","","","","","","","",null,null,null,null,null,"","","","","","","","","",null,null,0,{"$f":"IF(Z184<>\"新規\",\"\",IF(AI184=3,基本!$E$14,IF(OR(AI184=1,AI184=2),基本!$E$13,\"\")))","v":""},{"$f":"IF(CF184=0,\"\",IF(AI184=3,基本!$E$16*CF184,IF(OR(AI184=1,AI184=2),基本!$E$15*CF184)))","v":""},{"$f":"IF(AJ184=\"\",\"\",IF(AJ184>0,基本!$E$17*CF184))","v":""},{"$f":"IF(ER184=0,\"\",IF(AM184<=4,基本!$E$18*ER184,IF(AM184>4,基本!$E$19*ER184)))","v":""},{"$f":"IF(AC184=\"\",\"\",IF(AC184>=1,基本!$E$20))","v":""},0,"","","","","","","",null,null,null,null,null,null,null,null,null,null,null,null,null,null,null,null,null,null,null,null,null,null,null,null,null,null,null,null,null,null,null,null,null,null,null,null,null,null,null,null,null,null,null,null,null,null,null,null,null,null,null,null,null,"","","","","","","","","","","","","","","","","","","","","","","","","","","","","","","","","","","","","","",null,null,"","","","","","","","","","","","","","","","","","","","","","","","","","","","",""]
[176,null,null,null,null,null,null,null,null,null,null,null,null,null,null,null,null,null,null,null,null,null,null,null,null,null,null,null,null,null,null,null,null,null,null,null,null,null,null,null,null,null,null,null,null,null,null,null,null,null,null,null,null,null,null,null,null,null,null,null,null,null,null,null,null,null,null,null,null,null,null,null,null,null,null,null,null,null,null,null,null,null,null,0,"","","","","","","","","","","","","","","","","","","","","","","","","","","","","","","","","","",null,null,null,null,null,"","","","","","","","",null,null,null,null,null,"","","","","","","","","",null,null,0,{"$f":"IF(Z185<>\"新規\",\"\",IF(AI185=3,基本!$E$14,IF(OR(AI185=1,AI185=2),基本!$E$13,\"\")))","v":""},{"$f":"IF(CF185=0,\"\",IF(AI185=3,基本!$E$16*CF185,IF(OR(AI185=1,AI185=2),基本!$E$15*CF185)))","v":""},{"$f":"IF(AJ185=\"\",\"\",IF(AJ185>0,基本!$E$17*CF185))","v":""},{"$f":"IF(ER185=0,\"\",IF(AM185<=4,基本!$E$18*ER185,IF(AM185>4,基本!$E$19*ER185)))","v":""},{"$f":"IF(AC185=\"\",\"\",IF(AC185>=1,基本!$E$20))","v":""},0,"","","","","","","",null,null,null,null,null,null,null,null,null,null,null,null,null,null,null,null,null,null,null,null,null,null,null,null,null,null,null,null,null,null,null,null,null,null,null,null,null,null,null,null,null,null,null,null,null,null,null,null,null,null,null,null,null,"","","","","","","","","","","","","","","","","","","","","","","","","","","","","","","","","","","","","","",null,null,"","","","","","","","","","","","","","","","","","","","","","","","","","","","",""]
[177,null,null,null,null,null,null,null,null,null,null,null,null,null,null,null,null,null,null,null,null,null,null,null,null,null,null,null,null,null,null,null,null,null,null,null,null,null,null,null,null,null,null,null,null,null,null,null,null,null,null,null,null,null,null,null,null,null,null,null,null,null,null,null,null,null,null,null,null,null,null,null,null,null,null,null,null,null,null,null,null,null,null,0,"","","","","","","","","","","","","","","","","","","","","","","","","","","","","","","","","","",null,null,null,null,null,"","","","","","","","",null,null,null,null,null,"","","","","","","","","",null,null,0,{"$f":"IF(Z186<>\"新規\",\"\",IF(AI186=3,基本!$E$14,IF(OR(AI186=1,AI186=2),基本!$E$13,\"\")))","v":""},{"$f":"IF(CF186=0,\"\",IF(AI186=3,基本!$E$16*CF186,IF(OR(AI186=1,AI186=2),基本!$E$15*CF186)))","v":""},{"$f":"IF(AJ186=\"\",\"\",IF(AJ186>0,基本!$E$17*CF186))","v":""},{"$f":"IF(ER186=0,\"\",IF(AM186<=4,基本!$E$18*ER186,IF(AM186>4,基本!$E$19*ER186)))","v":""},{"$f":"IF(AC186=\"\",\"\",IF(AC186>=1,基本!$E$20))","v":""},0,"","","","","","","",null,null,null,null,null,null,null,null,null,null,null,null,null,null,null,null,null,null,null,null,null,null,null,null,null,null,null,null,null,null,null,null,null,null,null,null,null,null,null,null,null,null,null,null,null,null,null,null,null,null,null,null,null,"","","","","","","","","","","","","","","","","","","","","","","","","","","","","","","","","","","","","","",null,null,"","","","","","","","","","","","","","","","","","","","","","","","","","","","",""]
[178,null,null,null,null,null,null,null,null,null,null,null,null,null,null,null,null,null,null,null,null,null,null,null,null,null,null,null,null,null,null,null,null,null,null,null,null,null,null,null,null,null,null,null,null,null,null,null,null,null,null,null,null,null,null,null,null,null,null,null,null,null,null,null,null,null,null,null,null,null,null,null,null,null,null,null,null,null,null,null,null,null,null,0,"","","","","","","","","","","","","","","","","","","","","","","","","","","","","","","","","","",null,null,null,null,null,"","","","","","","","",null,null,null,null,null,"","","","","","","","","",null,null,0,{"$f":"IF(Z187<>\"新規\",\"\",IF(AI187=3,基本!$E$14,IF(OR(AI187=1,AI187=2),基本!$E$13,\"\")))","v":""},{"$f":"IF(CF187=0,\"\",IF(AI187=3,基本!$E$16*CF187,IF(OR(AI187=1,AI187=2),基本!$E$15*CF187)))","v":""},{"$f":"IF(AJ187=\"\",\"\",IF(AJ187>0,基本!$E$17*CF187))","v":""},{"$f":"IF(ER187=0,\"\",IF(AM187<=4,基本!$E$18*ER187,IF(AM187>4,基本!$E$19*ER187)))","v":""},{"$f":"IF(AC187=\"\",\"\",IF(AC187>=1,基本!$E$20))","v":""},0,"","","","","","","",null,null,null,null,null,null,null,null,null,null,null,null,null,null,null,null,null,null,null,null,null,null,null,null,null,null,null,null,null,null,null,null,null,null,null,null,null,null,null,null,null,null,null,null,null,null,null,null,null,null,null,null,null,"","","","","","","","","","","","","","","","","","","","","","","","","","","","","","","","","","","","","","",null,null,"","","","","","","","","","","","","","","","","","","","","","","","","","","","",""]
[179,null,null,null,null,null,null,null,null,null,null,null,null,null,null,null,null,null,null,null,null,null,null,null,null,null,null,null,null,null,null,null,null,null,null,null,null,null,null,null,null,null,null,null,null,null,null,null,null,null,null,null,null,null,null,null,null,null,null,null,null,null,null,null,null,null,null,null,null,null,null,null,null,null,null,null,null,null,null,null,null,null,null,0,"","","","","","","","","","","","","","","","","","","","","","","","","","","","","","","","","","",null,null,null,null,null,"","","","","","","","",null,null,null,null,null,"","","","","","","","","",null,null,0,{"$f":"IF(Z188<>\"新規\",\"\",IF(AI188=3,基本!$E$14,IF(OR(AI188=1,AI188=2),基本!$E$13,\"\")))","v":""},{"$f":"IF(CF188=0,\"\",IF(AI188=3,基本!$E$16*CF188,IF(OR(AI188=1,AI188=2),基本!$E$15*CF188)))","v":""},{"$f":"IF(AJ188=\"\",\"\",IF(AJ188>0,基本!$E$17*CF188))","v":""},{"$f":"IF(ER188=0,\"\",IF(AM188<=4,基本!$E$18*ER188,IF(AM188>4,基本!$E$19*ER188)))","v":""},{"$f":"IF(AC188=\"\",\"\",IF(AC188>=1,基本!$E$20))","v":""},0,"","","","","","","",null,null,null,null,null,null,null,null,null,null,null,null,null,null,null,null,null,null,null,null,null,null,null,null,null,null,null,null,null,null,null,null,null,null,null,null,null,null,null,null,null,null,null,null,null,null,null,null,null,null,null,null,null,"","","","","","","","","","","","","","","","","","","","","","","","","","","","","","","","","","","","","","",null,null,"","","","","","","","","","","","","","","","","","","","","","","","","","","","",""]
[180,null,null,null,null,null,null,null,null,null,null,null,null,null,null,null,null,null,null,null,null,null,null,null,null,null,null,null,null,null,null,null,null,null,null,null,null,null,null,null,null,null,null,null,null,null,null,null,null,null,null,null,null,null,null,null,null,null,null,null,null,null,null,null,null,null,null,null,null,null,null,null,null,null,null,null,null,null,null,null,null,null,null,0,"","","","","","","","","","","","","","","","","","","","","","","","","","","","","","","","","","",null,null,null,null,null,"","","","","","","","",null,null,null,null,null,"","","","","","","","","",null,null,0,{"$f":"IF(Z189<>\"新規\",\"\",IF(AI189=3,基本!$E$14,IF(OR(AI189=1,AI189=2),基本!$E$13,\"\")))","v":""},{"$f":"IF(CF189=0,\"\",IF(AI189=3,基本!$E$16*CF189,IF(OR(AI189=1,AI189=2),基本!$E$15*CF189)))","v":""},{"$f":"IF(AJ189=\"\",\"\",IF(AJ189>0,基本!$E$17*CF189))","v":""},{"$f":"IF(ER189=0,\"\",IF(AM189<=4,基本!$E$18*ER189,IF(AM189>4,基本!$E$19*ER189)))","v":""},{"$f":"IF(AC189=\"\",\"\",IF(AC189>=1,基本!$E$20))","v":""},0,"","","","","","","",null,null,null,null,null,null,null,null,null,null,null,null,null,null,null,null,null,null,null,null,null,null,null,null,null,null,null,null,null,null,null,null,null,null,null,null,null,null,null,null,null,null,null,null,null,null,null,null,null,null,null,null,null,"","","","","","","","","","","","","","","","","","","","","","","","","","","","","","","","","","","","","","",null,null,"","","","","","","","","","","","","","","","","","","","","","","","","","","","",""]
[181,null,null,null,null,null,null,null,null,null,null,null,null,null,null,null,null,null,null,null,null,null,null,null,null,null,null,null,null,null,null,null,null,null,null,null,null,null,null,null,null,null,null,null,null,null,null,null,null,null,null,null,null,null,null,null,null,null,null,null,null,null,null,null,null,null,null,null,null,null,null,null,null,null,null,null,null,null,null,null,null,null,null,0,"","","","","","","","","","","","","","","","","","","","","","","","","","","","","","","","","","",null,null,null,null,null,"","","","","","","","",null,null,null,null,null,"","","","","","","","","",null,null,0,{"$f":"IF(Z190<>\"新規\",\"\",IF(AI190=3,基本!$E$14,IF(OR(AI190=1,AI190=2),基本!$E$13,\"\")))","v":""},{"$f":"IF(CF190=0,\"\",IF(AI190=3,基本!$E$16*CF190,IF(OR(AI190=1,AI190=2),基本!$E$15*CF190)))","v":""},{"$f":"IF(AJ190=\"\",\"\",IF(AJ190>0,基本!$E$17*CF190))","v":""},{"$f":"IF(ER190=0,\"\",IF(AM190<=4,基本!$E$18*ER190,IF(AM190>4,基本!$E$19*ER190)))","v":""},{"$f":"IF(AC190=\"\",\"\",IF(AC190>=1,基本!$E$20))","v":""},0,"","","","","","","",null,null,null,null,null,null,null,null,null,null,null,null,null,null,null,null,null,null,null,null,null,null,null,null,null,null,null,null,null,null,null,null,null,null,null,null,null,null,null,null,null,null,null,null,null,null,null,null,null,null,null,null,null,"","","","","","","","","","","","","","","","","","","","","","","","","","","","","","","","","","","","","","",null,null,"","","","","","","","","","","","","","","","","","","","","","","","","","","","",""]
[182,null,null,null,null,null,null,null,null,null,null,null,null,null,null,null,null,null,null,null,null,null,null,null,null,null,null,null,null,null,null,null,null,null,null,null,null,null,null,null,null,null,null,null,null,null,null,null,null,null,null,null,null,null,null,null,null,null,null,null,null,null,null,null,null,null,null,null,null,null,null,null,null,null,null,null,null,null,null,null,null,null,null,0,"","","","","","","","","","","","","","","","","","","","","","","","","","","","","","","","","","",null,null,null,null,null,"","","","","","","","",null,null,null,null,null,"","","","","","","","","",null,null,0,{"$f":"IF(Z191<>\"新規\",\"\",IF(AI191=3,基本!$E$14,IF(OR(AI191=1,AI191=2),基本!$E$13,\"\")))","v":""},{"$f":"IF(CF191=0,\"\",IF(AI191=3,基本!$E$16*CF191,IF(OR(AI191=1,AI191=2),基本!$E$15*CF191)))","v":""},{"$f":"IF(AJ191=\"\",\"\",IF(AJ191>0,基本!$E$17*CF191))","v":""},{"$f":"IF(ER191=0,\"\",IF(AM191<=4,基本!$E$18*ER191,IF(AM191>4,基本!$E$19*ER191)))","v":""},{"$f":"IF(AC191=\"\",\"\",IF(AC191>=1,基本!$E$20))","v":""},0,"","","","","","","",null,null,null,null,null,null,null,null,null,null,null,null,null,null,null,null,null,null,null,null,null,null,null,null,null,null,null,null,null,null,null,null,null,null,null,null,null,null,null,null,null,null,null,null,null,null,null,null,null,null,null,null,null,"","","","","","","","","","","","","","","","","","","","","","","","","","","","","","","","","","","","","","",null,null,"","","","","","","","","","","","","","","","","","","","","","","","","","","","",""]
[183,null,null,null,null,null,null,null,null,null,null,null,null,null,null,null,null,null,null,null,null,null,null,null,null,null,null,null,null,null,null,null,null,null,null,null,null,null,null,null,null,null,null,null,null,null,null,null,null,null,null,null,null,null,null,null,null,null,null,null,null,null,null,null,null,null,null,null,null,null,null,null,null,null,null,null,null,null,null,null,null,null,null,0,"","","","","","","","","","","","","","","","","","","","","","","","","","","","","","","","","","",null,null,null,null,null,"","","","","","","","",null,null,null,null,null,"","","","","","","","","",null,null,0,{"$f":"IF(Z192<>\"新規\",\"\",IF(AI192=3,基本!$E$14,IF(OR(AI192=1,AI192=2),基本!$E$13,\"\")))","v":""},{"$f":"IF(CF192=0,\"\",IF(AI192=3,基本!$E$16*CF192,IF(OR(AI192=1,AI192=2),基本!$E$15*CF192)))","v":""},{"$f":"IF(AJ192=\"\",\"\",IF(AJ192>0,基本!$E$17*CF192))","v":""},{"$f":"IF(ER192=0,\"\",IF(AM192<=4,基本!$E$18*ER192,IF(AM192>4,基本!$E$19*ER192)))","v":""},{"$f":"IF(AC192=\"\",\"\",IF(AC192>=1,基本!$E$20))","v":""},0,"","","","","","","",null,null,null,null,null,null,null,null,null,null,null,null,null,null,null,null,null,null,null,null,null,null,null,null,null,null,null,null,null,null,null,null,null,null,null,null,null,null,null,null,null,null,null,null,null,null,null,null,null,null,null,null,null,"","","","","","","","","","","","","","","","","","","","","","","","","","","","","","","","","","","","","","",null,null,"","","","","","","","","","","","","","","","","","","","","","","","","","","","",""]
[184,null,null,null,null,null,null,null,null,null,null,null,null,null,null,null,null,null,null,null,null,null,null,null,null,null,null,null,null,null,null,null,null,null,null,null,null,null,null,null,null,null,null,null,null,null,null,null,null,null,null,null,null,null,null,null,null,null,null,null,null,null,null,null,null,null,null,null,null,null,null,null,null,null,null,null,null,null,null,null,null,null,null,0,"","","","","","","","","","","","","","","","","","","","","","","","","","","","","","","","","","",null,null,null,null,null,"","","","","","","","",null,null,null,null,null,"","","","","","","","","",null,null,0,{"$f":"IF(Z193<>\"新規\",\"\",IF(AI193=3,基本!$E$14,IF(OR(AI193=1,AI193=2),基本!$E$13,\"\")))","v":""},{"$f":"IF(CF193=0,\"\",IF(AI193=3,基本!$E$16*CF193,IF(OR(AI193=1,AI193=2),基本!$E$15*CF193)))","v":""},{"$f":"IF(AJ193=\"\",\"\",IF(AJ193>0,基本!$E$17*CF193))","v":""},{"$f":"IF(ER193=0,\"\",IF(AM193<=4,基本!$E$18*ER193,IF(AM193>4,基本!$E$19*ER193)))","v":""},{"$f":"IF(AC193=\"\",\"\",IF(AC193>=1,基本!$E$20))","v":""},0,"","","","","","","",null,null,null,null,null,null,null,null,null,null,null,null,null,null,null,null,null,null,null,null,null,null,null,null,null,null,null,null,null,null,null,null,null,null,null,null,null,null,null,null,null,null,null,null,null,null,null,null,null,null,null,null,null,"","","","","","","","","","","","","","","","","","","","","","","","","","","","","","","","","","","","","","",null,null,"","","","","","","","","","","","","","","","","","","","","","","","","","","","",""]
[185,null,null,null,null,null,null,null,null,null,null,null,null,null,null,null,null,null,null,null,null,null,null,null,null,null,null,null,null,null,null,null,null,null,null,null,null,null,null,null,null,null,null,null,null,null,null,null,null,null,null,null,null,null,null,null,null,null,null,null,null,null,null,null,null,null,null,null,null,null,null,null,null,null,null,null,null,null,null,null,null,null,null,0,"","","","","","","","","","","","","","","","","","","","","","","","","","","","","","","","","","",null,null,null,null,null,"","","","","","","","",null,null,null,null,null,"","","","","","","","","",null,null,0,{"$f":"IF(Z194<>\"新規\",\"\",IF(AI194=3,基本!$E$14,IF(OR(AI194=1,AI194=2),基本!$E$13,\"\")))","v":""},{"$f":"IF(CF194=0,\"\",IF(AI194=3,基本!$E$16*CF194,IF(OR(AI194=1,AI194=2),基本!$E$15*CF194)))","v":""},{"$f":"IF(AJ194=\"\",\"\",IF(AJ194>0,基本!$E$17*CF194))","v":""},{"$f":"IF(ER194=0,\"\",IF(AM194<=4,基本!$E$18*ER194,IF(AM194>4,基本!$E$19*ER194)))","v":""},{"$f":"IF(AC194=\"\",\"\",IF(AC194>=1,基本!$E$20))","v":""},0,"","","","","","","",null,null,null,null,null,null,null,null,null,null,null,null,null,null,null,null,null,null,null,null,null,null,null,null,null,null,null,null,null,null,null,null,null,null,null,null,null,null,null,null,null,null,null,null,null,null,null,null,null,null,null,null,null,"","","","","","","","","","","","","","","","","","","","","","","","","","","","","","","","","","","","","","",null,null,"","","","","","","","","","","","","","","","","","","","","","","","","","","","",""]
[186,null,null,null,null,null,null,null,null,null,null,null,null,null,null,null,null,null,null,null,null,null,null,null,null,null,null,null,null,null,null,null,null,null,null,null,null,null,null,null,null,null,null,null,null,null,null,null,null,null,null,null,null,null,null,null,null,null,null,null,null,null,null,null,null,null,null,null,null,null,null,null,null,null,null,null,null,null,null,null,null,null,null,0,"","","","","","","","","","","","","","","","","","","","","","","","","","","","","","","","","","",null,null,null,null,null,"","","","","","","","",null,null,null,null,null,"","","","","","","","","",null,null,0,{"$f":"IF(Z195<>\"新規\",\"\",IF(AI195=3,基本!$E$14,IF(OR(AI195=1,AI195=2),基本!$E$13,\"\")))","v":""},{"$f":"IF(CF195=0,\"\",IF(AI195=3,基本!$E$16*CF195,IF(OR(AI195=1,AI195=2),基本!$E$15*CF195)))","v":""},{"$f":"IF(AJ195=\"\",\"\",IF(AJ195>0,基本!$E$17*CF195))","v":""},{"$f":"IF(ER195=0,\"\",IF(AM195<=4,基本!$E$18*ER195,IF(AM195>4,基本!$E$19*ER195)))","v":""},{"$f":"IF(AC195=\"\",\"\",IF(AC195>=1,基本!$E$20))","v":""},0,"","","","","","","",null,null,null,null,null,null,null,null,null,null,null,null,null,null,null,null,null,null,null,null,null,null,null,null,null,null,null,null,null,null,null,null,null,null,null,null,null,null,null,null,null,null,null,null,null,null,null,null,null,null,null,null,null,"","","","","","","","","","","","","","","","","","","","","","","","","","","","","","","","","","","","","","",null,null,"","","","","","","","","","","","","","","","","","","","","","","","","","","","",""]
[187,null,null,null,null,null,null,null,null,null,null,null,null,null,null,null,null,null,null,null,null,null,null,null,null,null,null,null,null,null,null,null,null,null,null,null,null,null,null,null,null,null,null,null,null,null,null,null,null,null,null,null,null,null,null,null,null,null,null,null,null,null,null,null,null,null,null,null,null,null,null,null,null,null,null,null,null,null,null,null,null,null,null,0,"","","","","","","","","","","","","","","","","","","","","","","","","","","","","","","","","","",null,null,null,null,null,"","","","","","","","",null,null,null,null,null,"","","","","","","","","",null,null,0,{"$f":"IF(Z196<>\"新規\",\"\",IF(AI196=3,基本!$E$14,IF(OR(AI196=1,AI196=2),基本!$E$13,\"\")))","v":""},{"$f":"IF(CF196=0,\"\",IF(AI196=3,基本!$E$16*CF196,IF(OR(AI196=1,AI196=2),基本!$E$15*CF196)))","v":""},{"$f":"IF(AJ196=\"\",\"\",IF(AJ196>0,基本!$E$17*CF196))","v":""},{"$f":"IF(ER196=0,\"\",IF(AM196<=4,基本!$E$18*ER196,IF(AM196>4,基本!$E$19*ER196)))","v":""},{"$f":"IF(AC196=\"\",\"\",IF(AC196>=1,基本!$E$20))","v":""},0,"","","","","","","",null,null,null,null,null,null,null,null,null,null,null,null,null,null,null,null,null,null,null,null,null,null,null,null,null,null,null,null,null,null,null,null,null,null,null,null,null,null,null,null,null,null,null,null,null,null,null,null,null,null,null,null,null,"","","","","","","","","","","","","","","","","","","","","","","","","","","","","","","","","","","","","","",null,null,"","","","","","","","","","","","","","","","","","","","","","","","","","","","",""]
[188,null,null,null,null,null,null,null,null,null,null,null,null,null,null,null,null,null,null,null,null,null,null,null,null,null,null,null,null,null,null,null,null,null,null,null,null,null,null,null,null,null,null,null,null,null,null,null,null,null,null,null,null,null,null,null,null,null,null,null,null,null,null,null,null,null,null,null,null,null,null,null,null,null,null,null,null,null,null,null,null,null,null,0,"","","","","","","","","","","","","","","","","","","","","","","","","","","","","","","","","","",null,null,null,null,null,"","","","","","","","",null,null,null,null,null,"","","","","","","","","",null,null,0,{"$f":"IF(Z197<>\"新規\",\"\",IF(AI197=3,基本!$E$14,IF(OR(AI197=1,AI197=2),基本!$E$13,\"\")))","v":""},{"$f":"IF(CF197=0,\"\",IF(AI197=3,基本!$E$16*CF197,IF(OR(AI197=1,AI197=2),基本!$E$15*CF197)))","v":""},{"$f":"IF(AJ197=\"\",\"\",IF(AJ197>0,基本!$E$17*CF197))","v":""},{"$f":"IF(ER197=0,\"\",IF(AM197<=4,基本!$E$18*ER197,IF(AM197>4,基本!$E$19*ER197)))","v":""},{"$f":"IF(AC197=\"\",\"\",IF(AC197>=1,基本!$E$20))","v":""},0,"","","","","","","",null,null,null,null,null,null,null,null,null,null,null,null,null,null,null,null,null,null,null,null,null,null,null,null,null,null,null,null,null,null,null,null,null,null,null,null,null,null,null,null,null,null,null,null,null,null,null,null,null,null,null,null,null,"","","","","","","","","","","","","","","","","","","","","","","","","","","","","","","","","","","","","","",null,null,"","","","","","","","","","","","","","","","","","","","","","","","","","","","",""]
[189,null,null,null,null,null,null,null,null,null,null,null,null,null,null,null,null,null,null,null,null,null,null,null,null,null,null,null,null,null,null,null,null,null,null,null,null,null,null,null,null,null,null,null,null,null,null,null,null,null,null,null,null,null,null,null,null,null,null,null,null,null,null,null,null,null,null,null,null,null,null,null,null,null,null,null,null,null,null,null,null,null,null,0,"","","","","","","","","","","","","","","","","","","","","","","","","","","","","","","","","","",null,null,null,null,null,"","","","","","","","",null,null,null,null,null,"","","","","","","","","",null,null,0,{"$f":"IF(Z198<>\"新規\",\"\",IF(AI198=3,基本!$E$14,IF(OR(AI198=1,AI198=2),基本!$E$13,\"\")))","v":""},{"$f":"IF(CF198=0,\"\",IF(AI198=3,基本!$E$16*CF198,IF(OR(AI198=1,AI198=2),基本!$E$15*CF198)))","v":""},{"$f":"IF(AJ198=\"\",\"\",IF(AJ198>0,基本!$E$17*CF198))","v":""},{"$f":"IF(ER198=0,\"\",IF(AM198<=4,基本!$E$18*ER198,IF(AM198>4,基本!$E$19*ER198)))","v":""},{"$f":"IF(AC198=\"\",\"\",IF(AC198>=1,基本!$E$20))","v":""},0,"","","","","","","",null,null,null,null,null,null,null,null,null,null,null,null,null,null,null,null,null,null,null,null,null,null,null,null,null,null,null,null,null,null,null,null,null,null,null,null,null,null,null,null,null,null,null,null,null,null,null,null,null,null,null,null,null,"","","","","","","","","","","","","","","","","","","","","","","","","","","","","","","","","","","","","","",null,null,"","","","","","","","","","","","","","","","","","","","","","","","","","","","",""]
[190,null,null,null,null,null,null,null,null,null,null,null,null,null,null,null,null,null,null,null,null,null,null,null,null,null,null,null,null,null,null,null,null,null,null,null,null,null,null,null,null,null,null,null,null,null,null,null,null,null,null,null,null,null,null,null,null,null,null,null,null,null,null,null,null,null,null,null,null,null,null,null,null,null,null,null,null,null,null,null,null,null,null,0,"","","","","","","","","","","","","","","","","","","","","","","","","","","","","","","","","","",null,null,null,null,null,"","","","","","","","",null,null,null,null,null,"","","","","","","","","",null,null,0,{"$f":"IF(Z199<>\"新規\",\"\",IF(AI199=3,基本!$E$14,IF(OR(AI199=1,AI199=2),基本!$E$13,\"\")))","v":""},{"$f":"IF(CF199=0,\"\",IF(AI199=3,基本!$E$16*CF199,IF(OR(AI199=1,AI199=2),基本!$E$15*CF199)))","v":""},{"$f":"IF(AJ199=\"\",\"\",IF(AJ199>0,基本!$E$17*CF199))","v":""},{"$f":"IF(ER199=0,\"\",IF(AM199<=4,基本!$E$18*ER199,IF(AM199>4,基本!$E$19*ER199)))","v":""},{"$f":"IF(AC199=\"\",\"\",IF(AC199>=1,基本!$E$20))","v":""},0,"","","","","","","",null,null,null,null,null,null,null,null,null,null,null,null,null,null,null,null,null,null,null,null,null,null,null,null,null,null,null,null,null,null,null,null,null,null,null,null,null,null,null,null,null,null,null,null,null,null,null,null,null,null,null,null,null,"","","","","","","","","","","","","","","","","","","","","","","","","","","","","","","","","","","","","","",null,null,"","","","","","","","","","","","","","","","","","","","","","","","","","","","",""]
[191,null,null,null,null,null,null,null,null,null,null,null,null,null,null,null,null,null,null,null,null,null,null,null,null,null,null,null,null,null,null,null,null,null,null,null,null,null,null,null,null,null,null,null,null,null,null,null,null,null,null,null,null,null,null,null,null,null,null,null,null,null,null,null,null,null,null,null,null,null,null,null,null,null,null,null,null,null,null,null,null,null,null,0,"","","","","","","","","","","","","","","","","","","","","","","","","","","","","","","","","","",null,null,null,null,null,"","","","","","","","",null,null,null,null,null,"","","","","","","","","",null,null,0,{"$f":"IF(Z200<>\"新規\",\"\",IF(AI200=3,基本!$E$14,IF(OR(AI200=1,AI200=2),基本!$E$13,\"\")))","v":""},{"$f":"IF(CF200=0,\"\",IF(AI200=3,基本!$E$16*CF200,IF(OR(AI200=1,AI200=2),基本!$E$15*CF200)))","v":""},{"$f":"IF(AJ200=\"\",\"\",IF(AJ200>0,基本!$E$17*CF200))","v":""},{"$f":"IF(ER200=0,\"\",IF(AM200<=4,基本!$E$18*ER200,IF(AM200>4,基本!$E$19*ER200)))","v":""},{"$f":"IF(AC200=\"\",\"\",IF(AC200>=1,基本!$E$20))","v":""},0,"","","","","","","",null,null,null,null,null,null,null,null,null,null,null,null,null,null,null,null,null,null,null,null,null,null,null,null,null,null,null,null,null,null,null,null,null,null,null,null,null,null,null,null,null,null,null,null,null,null,null,null,null,null,null,null,null,"","","","","","","","","","","","","","","","","","","","","","","","","","","","","","","","","","","","","","",null,null,"","","","","","","","","","","","","","","","","","","","","","","","","","","","",""]
[192,null,null,null,null,null,null,null,null,null,null,null,null,null,null,null,null,null,null,null,null,null,null,null,null,null,null,null,null,null,null,null,null,null,null,null,null,null,null,null,null,null,null,null,null,null,null,null,null,null,null,null,null,null,null,null,null,null,null,null,null,null,null,null,null,null,null,null,null,null,null,null,null,null,null,null,null,null,null,null,null,null,null,0,"","","","","","","","","","","","","","","","","","","","","","","","","","","","","","","","","","",null,null,null,null,null,"","","","","","","","",null,null,null,null,null,"","","","","","","","","",null,null,0,{"$f":"IF(Z201<>\"新規\",\"\",IF(AI201=3,基本!$E$14,IF(OR(AI201=1,AI201=2),基本!$E$13,\"\")))","v":""},{"$f":"IF(CF201=0,\"\",IF(AI201=3,基本!$E$16*CF201,IF(OR(AI201=1,AI201=2),基本!$E$15*CF201)))","v":""},{"$f":"IF(AJ201=\"\",\"\",IF(AJ201>0,基本!$E$17*CF201))","v":""},{"$f":"IF(ER201=0,\"\",IF(AM201<=4,基本!$E$18*ER201,IF(AM201>4,基本!$E$19*ER201)))","v":""},{"$f":"IF(AC201=\"\",\"\",IF(AC201>=1,基本!$E$20))","v":""},0,"","","","","","","",null,null,null,null,null,null,null,null,null,null,null,null,null,null,null,null,null,null,null,null,null,null,null,null,null,null,null,null,null,null,null,null,null,null,null,null,null,null,null,null,null,null,null,null,null,null,null,null,null,null,null,null,null,"","","","","","","","","","","","","","","","","","","","","","","","","","","","","","","","","","","","","","",null,null,"","","","","","","","","","","","","","","","","","","","","","","","","","","","",""]
[193,null,null,null,null,null,null,null,null,null,null,null,null,null,null,null,null,null,null,null,null,null,null,null,null,null,null,null,null,null,null,null,null,null,null,null,null,null,null,null,null,null,null,null,null,null,null,null,null,null,null,null,null,null,null,null,null,null,null,null,null,null,null,null,null,null,null,null,null,null,null,null,null,null,null,null,null,null,null,null,null,null,null,0,"","","","","","","","","","","","","","","","","","","","","","","","","","","","","","","","","","",null,null,null,null,null,"","","","","","","","",null,null,null,null,null,"","","","","","","","","",null,null,0,{"$f":"IF(Z202<>\"新規\",\"\",IF(AI202=3,基本!$E$14,IF(OR(AI202=1,AI202=2),基本!$E$13,\"\")))","v":""},{"$f":"IF(CF202=0,\"\",IF(AI202=3,基本!$E$16*CF202,IF(OR(AI202=1,AI202=2),基本!$E$15*CF202)))","v":""},{"$f":"IF(AJ202=\"\",\"\",IF(AJ202>0,基本!$E$17*CF202))","v":""},{"$f":"IF(ER202=0,\"\",IF(AM202<=4,基本!$E$18*ER202,IF(AM202>4,基本!$E$19*ER202)))","v":""},{"$f":"IF(AC202=\"\",\"\",IF(AC202>=1,基本!$E$20))","v":""},0,{"$f":"IF($E202=\"\",\"\",IF($E202=\"協会けんぽ\",$EX202,\"\"))","v":""},{"$f":"IF($E202=\"\",\"\",IF($E202=\"健保組合\",$EX202,\"\"))","v":""},{"$f":"IF($E202=\"\",\"\",IF($E202=\"国保一般\",$EX202,\"\"))","v":""},{"$f":"IF($E202=\"\",\"\",IF($E202=\"後期高齢者\",$EX202,\"\"))","v":""},{"$f":"IF($E202=\"\",\"\",IF($E202=\"共済組合\",$EX202,\"\"))","v":""},{"$f":"IF($E202=\"\",\"\",IF($E202=\"退職者国保\",$EX202,\"\"))","v":""},{"$f":"IF($E202=\"\",\"\",IF($E202=\"国保組合\",$EX202,\"\"))","v":""},null,null,null,null,null,null,null,null,null,null,null,null,null,null,null,null,null,null,null,null,null,null,null,null,null,null,null,null,null,null,null,null,null,null,null,null,null,null,null,null,null,null,null,null,null,null,null,null,null,null,null,null,null,"","","","","","","","","","","","","","","","","","","","","","","","","","","","","","","","","","","","","","",null,null,"","","","","","","","","","","","","","","","","","","","","","","","","","","","",""]
[194,null,null,null,null,null,null,null,null,null,null,null,null,null,null,null,null,null,null,null,null,null,null,null,null,null,null,null,null,null,null,null,null,null,null,null,null,null,null,null,null,null,null,null,null,null,null,null,null,null,null,null,null,null,null,null,null,null,null,null,null,null,null,null,null,null,null,null,null,null,null,null,null,null,null,null,null,null,null,null,null,null,null,0,"","","","","","","","","","","","","","","","","","","","","","","",{"$f":"IF($CZ203=\"T\",1911,IF($CZ203=\"S\",1925,IF($CZ203=\"H\",1988,IF($CZ203=\"R\",2018,\"\"))))","v":""},"","","","","","","","","","",null,null,null,null,null,"","","","","","","","",null,null,null,null,null,"","","","","","","","","",null,null,0,{"$f":"IF(Z203<>\"新規\",\"\",IF(AI203=3,基本!$E$14,IF(OR(AI203=1,AI203=2),基本!$E$13,\"\")))","v":""},{"$f":"IF(CF203=0,\"\",IF(AI203=3,基本!$E$16*CF203,IF(OR(AI203=1,AI203=2),基本!$E$15*CF203)))","v":""},{"$f":"IF(AJ203=\"\",\"\",IF(AJ203>0,基本!$E$17*CF203))","v":""},{"$f":"IF(ER203=0,\"\",IF(AM203<=4,基本!$E$18*ER203,IF(AM203>4,基本!$E$19*ER203)))","v":""},{"$f":"IF(AC203=\"\",\"\",IF(AC203>=1,基本!$E$20))","v":""},0,"","","","","","","",null,null,null,null,null,null,null,null,null,null,null,null,null,null,null,null,null,null,null,null,null,null,null,null,null,null,null,null,null,null,null,null,null,null,null,null,null,null,null,null,null,null,null,null,null,null,null,null,null,null,null,null,null,"","","","","","","","","","","","","","","","","","","","","","","","","","","","","","","","","","","","","","",null,null,"","","","","","","","","","","","","","","","","","","","","","","","","",{"$f":"IF(JO203=8,MID(JN203,5,1),IF(JO203=7,MID(JN203,4,1),IF(JO203=6,MID(JN203,3,1),IF(JO203=5,MID(JN203,2,1),IF(JO203=4,LEFT(JN203),\"\")))))","v":""},"","",""]
[195,null,null,null,null,null,null,null,null,null,null,null,null,null,null,null,null,null,null,null,null,null,null,null,null,null,null,null,null,null,null,null,null,null,null,null,null,null,null,null,null,null,null,null,null,null,null,null,null,null,null,null,null,null,null,null,null,null,null,null,null,null,null,null,null,null,null,null,null,null,null,null,null,null,null,null,null,null,null,null,null,null,null,0,"","","","","","","","","","","","","","","","","","","","","","","","","","","","","","","","","","",null,null,null,null,null,"","","","","","","","",null,null,null,null,null,"","","","","","","","","",null,null,0,{"$f":"IF(Z204<>\"新規\",\"\",IF(AI204=3,基本!$E$14,IF(OR(AI204=1,AI204=2),基本!$E$13,\"\")))","v":""},{"$f":"IF(CF204=0,\"\",IF(AI204=3,基本!$E$16*CF204,IF(OR(AI204=1,AI204=2),基本!$E$15*CF204)))","v":""},{"$f":"IF(AJ204=\"\",\"\",IF(AJ204>0,基本!$E$17*CF204))","v":""},{"$f":"IF(ER204=0,\"\",IF(AM204<=4,基本!$E$18*ER204,IF(AM204>4,基本!$E$19*ER204)))","v":""},{"$f":"IF(AC204=\"\",\"\",IF(AC204>=1,基本!$E$20))","v":""},0,"","","","","","","",null,null,null,null,null,null,null,null,null,null,null,null,null,null,null,null,null,null,null,null,null,null,null,null,null,null,null,null,null,null,null,null,null,null,null,null,null,null,null,null,null,null,null,null,null,null,null,null,null,null,null,null,null,"","","","","","","","","","","","","","","","","","","","","","","","","","","","","","","","","","","","","","",null,null,"","","","","","","","","","","","","","","","","","","","","","","","","","","","",""]
[196,null,null,null,null,null,null,null,null,null,null,null,null,null,null,null,null,null,null,null,null,null,null,null,null,null,null,null,null,null,null,null,null,null,null,null,null,null,null,null,null,null,null,null,null,null,null,null,null,null,null,null,null,null,null,null,null,null,null,null,null,null,null,null,null,null,null,null,null,null,null,null,null,null,null,null,null,null,null,null,null,null,null,0,"","","","","","","","","","","","","","","","","","","","","","","","","","","","","","","","","","",null,null,null,null,null,"","","","","","","","",null,null,null,null,null,"","","","","","","","","",null,null,0,{"$f":"IF(Z205<>\"新規\",\"\",IF(AI205=3,基本!$E$14,IF(OR(AI205=1,AI205=2),基本!$E$13,\"\")))","v":""},{"$f":"IF(CF205=0,\"\",IF(AI205=3,基本!$E$16*CF205,IF(OR(AI205=1,AI205=2),基本!$E$15*CF205)))","v":""},{"$f":"IF(AJ205=\"\",\"\",IF(AJ205>0,基本!$E$17*CF205))","v":""},{"$f":"IF(ER205=0,\"\",IF(AM205<=4,基本!$E$18*ER205,IF(AM205>4,基本!$E$19*ER205)))","v":""},{"$f":"IF(AC205=\"\",\"\",IF(AC205>=1,基本!$E$20))","v":""},0,"","","","","","","",null,null,null,null,null,null,null,null,null,null,null,null,null,null,null,null,null,null,null,null,null,null,null,null,null,null,null,null,null,null,null,null,null,null,null,null,null,null,null,null,null,null,null,null,null,null,null,null,null,null,null,null,null,"","","","","","","","","","","","","","","","","","","","","","","","","","","","","","","","","","","","","","",null,null,"","","","","","","","","","","","","","","","","","","","","","","","","","","","",""]
[197,null,null,null,null,null,null,null,null,null,null,null,null,null,null,null,null,null,null,null,null,null,null,null,null,null,null,null,null,null,null,null,null,null,null,null,null,null,null,null,null,null,null,null,null,null,null,null,null,null,null,null,null,null,null,null,null,null,null,null,null,null,null,null,null,null,null,null,null,null,null,null,null,null,null,null,null,null,null,null,null,null,null,0,"","","","","","","","","","","","","","","","","","","","","","","","","","","","","","","","","","",null,null,null,null,null,"","","","","","","","",null,null,null,null,null,"","","","","","","","","",null,null,0,{"$f":"IF(Z206<>\"新規\",\"\",IF(AI206=3,基本!$E$14,IF(OR(AI206=1,AI206=2),基本!$E$13,\"\")))","v":""},{"$f":"IF(CF206=0,\"\",IF(AI206=3,基本!$E$16*CF206,IF(OR(AI206=1,AI206=2),基本!$E$15*CF206)))","v":""},{"$f":"IF(AJ206=\"\",\"\",IF(AJ206>0,基本!$E$17*CF206))","v":""},{"$f":"IF(ER206=0,\"\",IF(AM206<=4,基本!$E$18*ER206,IF(AM206>4,基本!$E$19*ER206)))","v":""},{"$f":"IF(AC206=\"\",\"\",IF(AC206>=1,基本!$E$20))","v":""},0,"","","","","","","",null,null,null,null,null,null,null,null,null,null,null,null,null,null,null,null,null,null,null,null,null,null,null,null,null,null,null,null,null,null,null,null,null,null,null,null,null,null,null,null,null,null,null,null,null,null,null,null,null,null,null,null,null,"","","","","","","","","","","","","","","","","","","","","","","","","","","","","","","","","","","","","","",null,null,"","","","","","","","","","","","","","","","","","","","","","","","","","","","",""]
[198,null,null,null,null,null,null,null,null,null,null,null,null,null,null,null,null,null,null,null,null,null,null,null,null,null,null,null,null,null,null,null,null,null,null,null,null,null,null,null,null,null,null,null,null,null,null,null,null,null,null,null,null,null,null,null,null,null,null,null,null,null,null,null,null,null,null,null,null,null,null,null,null,null,null,null,null,null,null,null,null,null,null,0,"","","","","","","","","","","","","","","","","","","","","","","","","","","","","","","","","","",null,null,null,null,null,"","","","","","","","",null,null,null,null,null,"","","","","","","","","",null,null,0,{"$f":"IF(Z207<>\"新規\",\"\",IF(AI207=3,基本!$E$14,IF(OR(AI207=1,AI207=2),基本!$E$13,\"\")))","v":""},{"$f":"IF(CF207=0,\"\",IF(AI207=3,基本!$E$16*CF207,IF(OR(AI207=1,AI207=2),基本!$E$15*CF207)))","v":""},{"$f":"IF(AJ207=\"\",\"\",IF(AJ207>0,基本!$E$17*CF207))","v":""},{"$f":"IF(ER207=0,\"\",IF(AM207<=4,基本!$E$18*ER207,IF(AM207>4,基本!$E$19*ER207)))","v":""},{"$f":"IF(AC207=\"\",\"\",IF(AC207>=1,基本!$E$20))","v":""},0,"","","","","","","",null,null,null,null,null,null,null,null,null,null,null,null,null,null,null,null,null,null,null,null,null,null,null,null,null,null,null,null,null,null,null,null,null,null,null,null,null,null,null,null,null,null,null,null,null,null,null,null,null,null,null,null,null,"","","","","","","","","","","","","","","","","","","","","","","","","","","","","","","","","","","","","","",null,null,"","","","","","","","","","","","","","","","","","","","","","","","","","","","",""]
[199,null,null,null,null,null,null,null,null,null,null,null,null,null,null,null,null,null,null,null,null,null,null,null,null,null,null,null,null,null,null,null,null,null,null,null,null,null,null,null,null,null,null,null,null,null,null,null,null,null,null,null,null,null,null,null,null,null,null,null,null,null,null,null,null,null,null,null,null,null,null,null,null,null,null,null,null,null,null,null,null,null,null,0,"","","","","","","","","","","","","","","","","","","","","","","","","","","","","","","","","","",null,null,null,null,null,"","","","","","","","",null,null,null,null,null,"","","","","","","","","",null,null,0,{"$f":"IF(Z208<>\"新規\",\"\",IF(AI208=3,基本!$E$14,IF(OR(AI208=1,AI208=2),基本!$E$13,\"\")))","v":""},{"$f":"IF(CF208=0,\"\",IF(AI208=3,基本!$E$16*CF208,IF(OR(AI208=1,AI208=2),基本!$E$15*CF208)))","v":""},{"$f":"IF(AJ208=\"\",\"\",IF(AJ208>0,基本!$E$17*CF208))","v":""},{"$f":"IF(ER208=0,\"\",IF(AM208<=4,基本!$E$18*ER208,IF(AM208>4,基本!$E$19*ER208)))","v":""},{"$f":"IF(AC208=\"\",\"\",IF(AC208>=1,基本!$E$20))","v":""},0,"","","","","","","",null,null,null,null,null,null,null,null,null,null,null,null,null,null,null,null,null,null,null,null,null,null,null,null,null,null,null,null,null,null,null,null,null,null,null,null,null,null,null,null,null,null,null,null,null,null,null,null,null,null,null,null,null,"","","","","","","","","","","","","","","","","","","","","","","","","","","","","","","","","","","","","","",null,null,"","","","","","","","","","","","","","","","","","","","","","","","","","","","",""]
[200,null,null,null,null,null,null,null,null,null,null,null,null,null,null,null,null,null,null,null,null,null,null,null,null,null,null,null,null,null,null,null,null,null,null,null,null,null,null,null,null,null,null,null,null,null,null,null,null,null,null,null,null,null,null,null,null,null,null,null,null,null,null,null,null,null,null,null,null,null,null,null,null,null,null,null,null,null,null,null,null,null,null,0,"","","","","","","","","","","","","","","","","","","","","","","","","","","","","","","","","","",null,null,null,null,null,"","","","","","","","",null,null,null,null,null,"","","","","","","","","",null,null,0,{"$f":"IF(Z209<>\"新規\",\"\",IF(AI209=3,基本!$E$14,IF(OR(AI209=1,AI209=2),基本!$E$13,\"\")))","v":""},{"$f":"IF(CF209=0,\"\",IF(AI209=3,基本!$E$16*CF209,IF(OR(AI209=1,AI209=2),基本!$E$15*CF209)))","v":""},{"$f":"IF(AJ209=\"\",\"\",IF(AJ209>0,基本!$E$17*CF209))","v":""},{"$f":"IF(ER209=0,\"\",IF(AM209<=4,基本!$E$18*ER209,IF(AM209>4,基本!$E$19*ER209)))","v":""},{"$f":"IF(AC209=\"\",\"\",IF(AC209>=1,基本!$E$20))","v":""},0,"","","","","","","",null,null,null,null,null,null,null,null,null,null,null,null,null,null,null,null,null,null,null,null,null,null,null,null,null,null,null,null,null,null,null,null,null,null,null,null,null,null,null,null,null,null,null,null,null,null,null,null,null,null,null,null,null,"","","","","","","","","","","","","","","","","","","","","","","","","","","","","","","","","","","","","","",null,null,"","","","","","","","","","","","","","","","","","","","","","","","","","","","",""]
[201,null,null,null,null,null,null,null,null,null,null,null,null,null,null,null,null,null,null,null,null,null,null,null,null,null,null,null,null,null,null,null,null,null,null,null,null,null,null,null,null,null,null,null,null,null,null,null,null,null,null,null,null,null,null,null,null,null,null,null,null,null,null,null,null,null,null,null,null,null,null,null,null,null,null,null,null,null,null,null,null,null,null,0,"","","","","","","","","","","","","","","","","","","","","","","","","","","","","","","","","","",null,null,null,null,null,"","","","","","","","",null,null,null,null,null,"","","","","","","","","",null,null,0,{"$f":"IF(Z210<>\"新規\",\"\",IF(AI210=3,基本!$E$14,IF(OR(AI210=1,AI210=2),基本!$E$13,\"\")))","v":""},{"$f":"IF(CF210=0,\"\",IF(AI210=3,基本!$E$16*CF210,IF(OR(AI210=1,AI210=2),基本!$E$15*CF210)))","v":""},{"$f":"IF(AJ210=\"\",\"\",IF(AJ210>0,基本!$E$17*CF210))","v":""},{"$f":"IF(ER210=0,\"\",IF(AM210<=4,基本!$E$18*ER210,IF(AM210>4,基本!$E$19*ER210)))","v":""},{"$f":"IF(AC210=\"\",\"\",IF(AC210>=1,基本!$E$20))","v":""},0,"","","","","","","",null,null,null,null,null,null,null,null,null,null,null,null,null,null,null,null,null,null,null,null,null,null,null,null,null,null,null,null,null,null,null,null,null,null,null,null,null,null,null,null,null,null,null,null,null,null,null,null,null,null,null,null,null,"","","","","","","","","","","","","","","","","","","","","","","","","","","","","","","","","","","","","","",null,null,"","","","","","","","","","","","","","","","","","","","","","","","","","","","",""]
[202,null,null,null,null,null,null,null,null,null,null,null,null,null,null,null,null,null,null,null,null,null,null,null,null,null,null,null,null,null,null,null,null,null,null,null,null,null,null,null,null,null,null,null,null,null,null,null,null,null,null,null,null,null,null,null,null,null,null,null,null,null,null,null,null,null,null,null,null,null,null,null,null,null,null,null,null,null,null,null,null,null,null,0,"","","","","","","","","","","","","","","","","","","","","","","","","","","","","","","","","","",null,null,null,null,null,"","","","","","","","",null,null,null,null,null,"","","","","","","","","",null,null,0,{"$f":"IF(Z211<>\"新規\",\"\",IF(AI211=3,基本!$E$14,IF(OR(AI211=1,AI211=2),基本!$E$13,\"\")))","v":""},{"$f":"IF(CF211=0,\"\",IF(AI211=3,基本!$E$16*CF211,IF(OR(AI211=1,AI211=2),基本!$E$15*CF211)))","v":""},{"$f":"IF(AJ211=\"\",\"\",IF(AJ211>0,基本!$E$17*CF211))","v":""},{"$f":"IF(ER211=0,\"\",IF(AM211<=4,基本!$E$18*ER211,IF(AM211>4,基本!$E$19*ER211)))","v":""},{"$f":"IF(AC211=\"\",\"\",IF(AC211>=1,基本!$E$20))","v":""},0,"","","","","","","",null,null,null,null,null,null,null,null,null,null,null,null,null,null,null,null,null,null,null,null,null,null,null,null,null,null,null,null,null,null,null,null,null,null,null,null,null,null,null,null,null,null,null,null,null,null,null,null,null,null,null,null,null,"","","","","","","","","","","","","","","","","","","","","","","","","","","","","","","","","","","","","","",null,null,"","","","","","","","","","","","","","","","","","","","","","","","","","","","",""]
[203,null,null,null,null,null,null,null,null,null,null,null,null,null,null,null,null,null,null,null,null,null,null,null,null,null,null,null,null,null,null,null,null,null,null,null,null,null,null,null,null,null,null,null,null,null,null,null,null,null,null,null,null,null,null,null,null,null,null,null,null,null,null,null,null,null,null,null,null,null,null,null,null,null,null,null,null,null,null,null,null,null,null,0,"","","","","","","","","","","","","","","","","","","","","","","","","","","","","","","","","","",null,null,null,null,null,"","","","","","","","",null,null,null,null,null,"","","","","","","","","",null,null,0,{"$f":"IF(Z212<>\"新規\",\"\",IF(AI212=3,基本!$E$14,IF(OR(AI212=1,AI212=2),基本!$E$13,\"\")))","v":""},{"$f":"IF(CF212=0,\"\",IF(AI212=3,基本!$E$16*CF212,IF(OR(AI212=1,AI212=2),基本!$E$15*CF212)))","v":""},{"$f":"IF(AJ212=\"\",\"\",IF(AJ212>0,基本!$E$17*CF212))","v":""},{"$f":"IF(ER212=0,\"\",IF(AM212<=4,基本!$E$18*ER212,IF(AM212>4,基本!$E$19*ER212)))","v":""},{"$f":"IF(AC212=\"\",\"\",IF(AC212>=1,基本!$E$20))","v":""},0,"","","","","","","",null,null,null,null,null,null,null,null,null,null,null,null,null,null,null,null,null,null,null,null,null,null,null,null,null,null,null,null,null,null,null,null,null,null,null,null,null,null,null,null,null,null,null,null,null,null,null,null,null,null,null,null,null,"","","","","","","","","","","","","","","","","","","","","","","","","","","","","","","","","","","","","","",null,null,"","","","","","","","","","","","","","","","","","","","","","","","","","","","",""]
[204,null,null,null,null,null,null,null,null,null,null,null,null,null,null,null,null,null,null,null,null,null,null,null,null,null,null,null,null,null,null,null,null,null,null,null,null,null,null,null,null,null,null,null,null,null,null,null,null,null,null,null,null,null,null,null,null,null,null,null,null,null,null,null,null,null,null,null,null,null,null,null,null,null,null,null,null,null,null,null,null,null,null,0,"","","","","","","","","","","","","","","","","","","","","","","","","","","","","","","","","","",null,null,null,null,null,"","","","","","","","",null,null,null,null,null,"","","","","","","","","",null,null,0,{"$f":"IF(Z213<>\"新規\",\"\",IF(AI213=3,基本!$E$14,IF(OR(AI213=1,AI213=2),基本!$E$13,\"\")))","v":""},{"$f":"IF(CF213=0,\"\",IF(AI213=3,基本!$E$16*CF213,IF(OR(AI213=1,AI213=2),基本!$E$15*CF213)))","v":""},{"$f":"IF(AJ213=\"\",\"\",IF(AJ213>0,基本!$E$17*CF213))","v":""},{"$f":"IF(ER213=0,\"\",IF(AM213<=4,基本!$E$18*ER213,IF(AM213>4,基本!$E$19*ER213)))","v":""},{"$f":"IF(AC213=\"\",\"\",IF(AC213>=1,基本!$E$20))","v":""},0,"","","","","","","",null,null,null,null,null,null,null,null,null,null,null,null,null,null,null,null,null,null,null,null,null,null,null,null,null,null,null,null,null,null,null,null,null,null,null,null,null,null,null,null,null,null,null,null,null,null,null,null,null,null,null,null,null,"","","","","","","","","","","","","","","","","","","","","","","","","","","","","","","","","","","","","","",null,null,"","","","","","","","","","","","","","","","","","","","","","","","","","","","",""]
[205,null,null,null,null,null,null,null,null,null,null,null,null,null,null,null,null,null,null,null,null,null,null,null,null,null,null,null,null,null,null,null,null,null,null,null,null,null,null,null,null,null,null,null,null,null,null,null,null,null,null,null,null,null,null,null,null,null,null,null,null,null,null,null,null,null,null,null,null,null,null,null,null,null,null,null,null,null,null,null,null,null,null,0,"","","","","","","","","","","","","","","","","","","","","","","","","","","","","","","","","","",null,null,null,null,null,"","","","","","","","",null,null,null,null,null,"","","","","","","","","",null,null,0,{"$f":"IF(Z214<>\"新規\",\"\",IF(AI214=3,基本!$E$14,IF(OR(AI214=1,AI214=2),基本!$E$13,\"\")))","v":""},{"$f":"IF(CF214=0,\"\",IF(AI214=3,基本!$E$16*CF214,IF(OR(AI214=1,AI214=2),基本!$E$15*CF214)))","v":""},{"$f":"IF(AJ214=\"\",\"\",IF(AJ214>0,基本!$E$17*CF214))","v":""},{"$f":"IF(ER214=0,\"\",IF(AM214<=4,基本!$E$18*ER214,IF(AM214>4,基本!$E$19*ER214)))","v":""},{"$f":"IF(AC214=\"\",\"\",IF(AC214>=1,基本!$E$20))","v":""},0,"","","","","","","",null,null,null,null,null,null,null,null,null,null,null,null,null,null,null,null,null,null,null,null,null,null,null,null,null,null,null,null,null,null,null,null,null,null,null,null,null,null,null,null,null,null,null,null,null,null,null,null,null,null,null,null,null,"","","","","","","","","","","","","","","","","","","","","","","","","","","","","","","","","","","","","","",null,null,"","","","","","","","","","","","","","","","","","","","","","","","","","","","",""]
[206,null,null,null,null,null,null,null,null,null,null,null,null,null,null,null,null,null,null,null,null,null,null,null,null,null,null,null,null,null,null,null,null,null,null,null,null,null,null,null,null,null,null,null,null,null,null,null,null,null,null,null,null,null,null,null,null,null,null,null,null,null,null,null,null,null,null,null,null,null,null,null,null,null,null,null,null,null,null,null,null,null,null,0,"","","","","","","","","","","","","","","","","","","","","","","","","","","","","","","","","","",null,null,null,null,null,"","","","","","","","",null,null,null,null,null,"","","","","","","","","",null,null,0,{"$f":"IF(Z215<>\"新規\",\"\",IF(AI215=3,基本!$E$14,IF(OR(AI215=1,AI215=2),基本!$E$13,\"\")))","v":""},{"$f":"IF(CF215=0,\"\",IF(AI215=3,基本!$E$16*CF215,IF(OR(AI215=1,AI215=2),基本!$E$15*CF215)))","v":""},{"$f":"IF(AJ215=\"\",\"\",IF(AJ215>0,基本!$E$17*CF215))","v":""},{"$f":"IF(ER215=0,\"\",IF(AM215<=4,基本!$E$18*ER215,IF(AM215>4,基本!$E$19*ER215)))","v":""},{"$f":"IF(AC215=\"\",\"\",IF(AC215>=1,基本!$E$20))","v":""},0,"","","","","","","",null,null,null,null,null,null,null,null,null,null,null,null,null,null,null,null,null,null,null,null,null,null,null,null,null,null,null,null,null,null,null,null,null,null,null,null,null,null,null,null,null,null,null,null,null,null,null,null,null,null,null,null,null,"","","","","","","","","","","","","","","","","","","","","","","","","","","","","","","","","","","","","","",null,null,"","","","","","","","","","","","","","","","","","","","","","","","","","","","",""]
[207,null,null,null,null,null,null,null,null,null,null,null,null,null,null,null,null,null,null,null,null,null,null,null,null,null,null,null,null,null,null,null,null,null,null,null,null,null,null,null,null,null,null,null,null,null,null,null,null,null,null,null,null,null,null,null,null,null,null,null,null,null,null,null,null,null,null,null,null,null,null,null,null,null,null,null,null,null,null,null,null,null,null,0,"","","","","","","","","","","","","","","","","","","","","","","","","","","","","","","","","","",null,null,null,null,null,"","","","","","","","",null,null,null,null,null,"","","","","","","","","",null,null,0,{"$f":"IF(Z216<>\"新規\",\"\",IF(AI216=3,基本!$E$14,IF(OR(AI216=1,AI216=2),基本!$E$13,\"\")))","v":""},{"$f":"IF(CF216=0,\"\",IF(AI216=3,基本!$E$16*CF216,IF(OR(AI216=1,AI216=2),基本!$E$15*CF216)))","v":""},{"$f":"IF(AJ216=\"\",\"\",IF(AJ216>0,基本!$E$17*CF216))","v":""},{"$f":"IF(ER216=0,\"\",IF(AM216<=4,基本!$E$18*ER216,IF(AM216>4,基本!$E$19*ER216)))","v":""},{"$f":"IF(AC216=\"\",\"\",IF(AC216>=1,基本!$E$20))","v":""},0,"","","","","","","",null,null,null,null,null,null,null,null,null,null,null,null,null,null,null,null,null,null,null,null,null,null,null,null,null,null,null,null,null,null,null,null,null,null,null,null,null,null,null,null,null,null,null,null,null,null,null,null,null,null,null,null,null,"","","","","","","","","","","","","","","","","","","","","","","","","","","","","","","","","","","","","","",null,null,"","","","","","","","","","","","","","","","","","","","","","","","","","","","",""]
[208,null,null,null,null,null,null,null,null,null,null,null,null,null,null,null,null,null,null,null,null,null,null,null,null,null,null,null,null,null,null,null,null,null,null,null,null,null,null,null,null,null,null,null,null,null,null,null,null,null,null,null,null,null,null,null,null,null,null,null,null,null,null,null,null,null,null,null,null,null,null,null,null,null,null,null,null,null,null,null,null,null,null,0,"","","","","","","","","","","","","","","","","","","","","","","","","","","","","","","","","","",null,null,null,null,null,"","","","","","","","",null,null,null,null,null,"","","","","","","","","",null,null,0,{"$f":"IF(Z217<>\"新規\",\"\",IF(AI217=3,基本!$E$14,IF(OR(AI217=1,AI217=2),基本!$E$13,\"\")))","v":""},{"$f":"IF(CF217=0,\"\",IF(AI217=3,基本!$E$16*CF217,IF(OR(AI217=1,AI217=2),基本!$E$15*CF217)))","v":""},{"$f":"IF(AJ217=\"\",\"\",IF(AJ217>0,基本!$E$17*CF217))","v":""},{"$f":"IF(ER217=0,\"\",IF(AM217<=4,基本!$E$18*ER217,IF(AM217>4,基本!$E$19*ER217)))","v":""},{"$f":"IF(AC217=\"\",\"\",IF(AC217>=1,基本!$E$20))","v":""},0,"","","","","","","",null,null,null,null,null,null,null,null,null,null,null,null,null,null,null,null,null,null,null,null,null,null,null,null,null,null,null,null,null,null,null,null,null,null,null,null,null,null,null,null,null,null,null,null,null,null,null,null,null,null,null,null,null,"","","","","","","","","","","","","","","","","","","","","","","","","","","","","","","","","","","","","","",null,null,"","","","","","","","","","","","","","","","","","","","","","","","","","","","",""]
[209,null,null,null,null,null,null,null,null,null,null,null,null,null,null,null,null,null,null,null,null,null,null,null,null,null,null,null,null,null,null,null,null,null,null,null,null,null,null,null,null,null,null,null,null,null,null,null,null,null,null,null,null,null,null,null,null,null,null,null,null,null,null,null,null,null,null,null,null,null,null,null,null,null,null,null,null,null,null,null,null,null,null,0,"","","","","","","","","","","","","","","","","","","","","","","","","","","","","","","","","","",null,null,null,null,null,"","","","","","","","",null,null,null,null,null,"","","","","","","","","",null,null,0,{"$f":"IF(Z218<>\"新規\",\"\",IF(AI218=3,基本!$E$14,IF(OR(AI218=1,AI218=2),基本!$E$13,\"\")))","v":""},{"$f":"IF(CF218=0,\"\",IF(AI218=3,基本!$E$16*CF218,IF(OR(AI218=1,AI218=2),基本!$E$15*CF218)))","v":""},{"$f":"IF(AJ218=\"\",\"\",IF(AJ218>0,基本!$E$17*CF218))","v":""},{"$f":"IF(ER218=0,\"\",IF(AM218<=4,基本!$E$18*ER218,IF(AM218>4,基本!$E$19*ER218)))","v":""},{"$f":"IF(AC218=\"\",\"\",IF(AC218>=1,基本!$E$20))","v":""},0,"","","","","","","",null,null,null,null,null,null,null,null,null,null,null,null,null,null,null,null,null,null,null,null,null,null,null,null,null,null,null,null,null,null,null,null,null,null,null,null,null,null,null,null,null,null,null,null,null,null,null,null,null,null,null,null,null,"","","","","","","","","","","","","","","","","","","","","","","","","","","","","","","","","","","","","","",null,null,"","","","","","","","","","","","","","","","","","","","","","","","","","","","",""]
[210,null,null,null,null,null,null,null,null,null,null,null,null,null,null,null,null,null,null,null,null,null,null,null,null,null,null,null,null,null,null,null,null,null,null,null,null,null,null,null,null,null,null,null,null,null,null,null,null,null,null,null,null,null,null,null,null,null,null,null,null,null,null,null,null,null,null,null,null,null,null,null,null,null,null,null,null,null,null,null,null,null,null,0,"","","","","","","","","","","","","","","","","","","","","","","","","","","","","","","","","","",null,null,null,null,null,"","","","","","","","",null,null,null,null,null,"","","","","","","","","",null,null,0,{"$f":"IF(Z219<>\"新規\",\"\",IF(AI219=3,基本!$E$14,IF(OR(AI219=1,AI219=2),基本!$E$13,\"\")))","v":""},{"$f":"IF(CF219=0,\"\",IF(AI219=3,基本!$E$16*CF219,IF(OR(AI219=1,AI219=2),基本!$E$15*CF219)))","v":""},{"$f":"IF(AJ219=\"\",\"\",IF(AJ219>0,基本!$E$17*CF219))","v":""},{"$f":"IF(ER219=0,\"\",IF(AM219<=4,基本!$E$18*ER219,IF(AM219>4,基本!$E$19*ER219)))","v":""},{"$f":"IF(AC219=\"\",\"\",IF(AC219>=1,基本!$E$20))","v":""},0,"","","","","","","",null,null,null,null,null,null,null,null,null,null,null,null,null,null,null,null,null,null,null,null,null,null,null,null,null,null,null,null,null,null,null,null,null,null,null,null,null,null,null,null,null,null,null,null,null,null,null,null,null,null,null,null,null,"","","","","","","","","","","","","","","","","","","","","","","","","","","","","","","","","","","","","","",null,null,"","","","","","","","","","","","","","","","","","","","","","","","","","","","",""]
[211,null,null,null,null,null,null,null,null,null,null,null,null,null,null,null,null,null,null,null,null,null,null,null,null,null,null,null,null,null,null,null,null,null,null,null,null,null,null,null,null,null,null,null,null,null,null,null,null,null,null,null,null,null,null,null,null,null,null,null,null,null,null,null,null,null,null,null,null,null,null,null,null,null,null,null,null,null,null,null,null,null,null,0,"","","","","","","","","","","","","","","","","","","","","","","","","","","","","","","","","","",null,null,null,null,null,"","","","","","","","",null,null,null,null,null,"","","","","","","","","",null,null,0,{"$f":"IF(Z220<>\"新規\",\"\",IF(AI220=3,基本!$E$14,IF(OR(AI220=1,AI220=2),基本!$E$13,\"\")))","v":""},{"$f":"IF(CF220=0,\"\",IF(AI220=3,基本!$E$16*CF220,IF(OR(AI220=1,AI220=2),基本!$E$15*CF220)))","v":""},{"$f":"IF(AJ220=\"\",\"\",IF(AJ220>0,基本!$E$17*CF220))","v":""},{"$f":"IF(ER220=0,\"\",IF(AM220<=4,基本!$E$18*ER220,IF(AM220>4,基本!$E$19*ER220)))","v":""},{"$f":"IF(AC220=\"\",\"\",IF(AC220>=1,基本!$E$20))","v":""},0,"","","","","","","",null,null,null,null,null,null,null,null,null,null,null,null,null,null,null,null,null,null,null,null,null,null,null,null,null,null,null,null,null,null,null,null,null,null,null,null,null,null,null,null,null,null,null,null,null,null,null,null,null,null,null,null,null,"","","","","","","","","","","","","","","","","","","","","","","","","","","","","","","","","","","","","","",null,null,"","","","","","","","","","","","","","","","","","","","","","","","","","","","",""]
[212,null,null,null,null,null,null,null,null,null,null,null,null,null,null,null,null,null,null,null,null,null,null,null,null,null,null,null,null,null,null,null,null,null,null,null,null,null,null,null,null,null,null,null,null,null,null,null,null,null,null,null,null,null,null,null,null,null,null,null,null,null,null,null,null,null,null,null,null,null,null,null,null,null,null,null,null,null,null,null,null,null,null,0,"","","","","","","","","","","","","","","","","","","","","","","","","","","","","","","","","","",null,null,null,null,null,"","","","","","","","",null,null,null,null,null,"","","","","","","","","",null,null,0,{"$f":"IF(Z221<>\"新規\",\"\",IF(AI221=3,基本!$E$14,IF(OR(AI221=1,AI221=2),基本!$E$13,\"\")))","v":""},{"$f":"IF(CF221=0,\"\",IF(AI221=3,基本!$E$16*CF221,IF(OR(AI221=1,AI221=2),基本!$E$15*CF221)))","v":""},{"$f":"IF(AJ221=\"\",\"\",IF(AJ221>0,基本!$E$17*CF221))","v":""},{"$f":"IF(ER221=0,\"\",IF(AM221<=4,基本!$E$18*ER221,IF(AM221>4,基本!$E$19*ER221)))","v":""},{"$f":"IF(AC221=\"\",\"\",IF(AC221>=1,基本!$E$20))","v":""},0,"","","","","","","",null,null,null,null,null,null,null,null,null,null,null,null,null,null,null,null,null,null,null,null,null,null,null,null,null,null,null,null,null,null,null,null,null,null,null,null,null,null,null,null,null,null,null,null,null,null,null,null,null,null,null,null,null,"","","","","","","","","","","","","","","","","","","","","","","","","","","","","","","","","","","","","","",null,null,"","","","","","","","","","","","","","","","","","","","","","","","","","","","",""]
[213,null,null,null,null,null,null,null,null,null,null,null,null,null,null,null,null,null,null,null,null,null,null,null,null,null,null,null,null,null,null,null,null,null,null,null,null,null,null,null,null,null,null,null,null,null,null,null,null,null,null,null,null,null,null,null,null,null,null,null,null,null,null,null,null,null,null,null,null,null,null,null,null,null,null,null,null,null,null,null,null,null,null,0,"","","","","","","","","","","","","","","","","","","","","","","","","","","","","","","","","","",null,null,null,null,null,"","","","","","","","",null,null,null,null,null,"","","","","","","","","",null,null,0,{"$f":"IF(Z222<>\"新規\",\"\",IF(AI222=3,基本!$E$14,IF(OR(AI222=1,AI222=2),基本!$E$13,\"\")))","v":""},{"$f":"IF(CF222=0,\"\",IF(AI222=3,基本!$E$16*CF222,IF(OR(AI222=1,AI222=2),基本!$E$15*CF222)))","v":""},{"$f":"IF(AJ222=\"\",\"\",IF(AJ222>0,基本!$E$17*CF222))","v":""},{"$f":"IF(ER222=0,\"\",IF(AM222<=4,基本!$E$18*ER222,IF(AM222>4,基本!$E$19*ER222)))","v":""},{"$f":"IF(AC222=\"\",\"\",IF(AC222>=1,基本!$E$20))","v":""},0,"","","","","","","",null,null,null,null,null,null,null,null,null,null,null,null,null,null,null,null,null,null,null,null,null,null,null,null,null,null,null,null,null,null,null,null,null,null,null,null,null,null,null,null,null,null,null,null,null,null,null,null,null,null,null,null,null,"","","","","","","","","","","","","","","","","","","","","","","","","","","","","","","","","","","","","","",null,null,"","","","","","","","","","","","","","","","","","","","","","","","","","","","",""]
[214,null,null,null,null,null,null,null,null,null,null,null,null,null,null,null,null,null,null,null,null,null,null,null,null,null,null,null,null,null,null,null,null,null,null,null,null,null,null,null,null,null,null,null,null,null,null,null,null,null,null,null,null,null,null,null,null,null,null,null,null,null,null,null,null,null,null,null,null,null,null,null,null,null,null,null,null,null,null,null,null,null,null,0,"","","","","","","","","","","","","","","","","","","","","","","","","","","","","","","","","","",null,null,null,null,null,"","","","","","","","",null,null,null,null,null,"","","","","","","","","",null,null,0,{"$f":"IF(Z223<>\"新規\",\"\",IF(AI223=3,基本!$E$14,IF(OR(AI223=1,AI223=2),基本!$E$13,\"\")))","v":""},{"$f":"IF(CF223=0,\"\",IF(AI223=3,基本!$E$16*CF223,IF(OR(AI223=1,AI223=2),基本!$E$15*CF223)))","v":""},{"$f":"IF(AJ223=\"\",\"\",IF(AJ223>0,基本!$E$17*CF223))","v":""},{"$f":"IF(ER223=0,\"\",IF(AM223<=4,基本!$E$18*ER223,IF(AM223>4,基本!$E$19*ER223)))","v":""},{"$f":"IF(AC223=\"\",\"\",IF(AC223>=1,基本!$E$20))","v":""},0,"","","","","","","",null,null,null,null,null,null,null,null,null,null,null,null,null,null,null,null,null,null,null,null,null,null,null,null,null,null,null,null,null,null,null,null,null,null,null,null,null,null,null,null,null,null,null,null,null,null,null,null,null,null,null,null,null,"","","","","","","","","","","","","","","","","","","","","","","","","","","","","","","","","","","","","","",null,null,"","","","","","","","","","","","","","","","","","","","","","","","","","","","",""]
[215,null,null,null,null,null,null,null,null,null,null,null,null,null,null,null,null,null,null,null,null,null,null,null,null,null,null,null,null,null,null,null,null,null,null,null,null,null,null,null,null,null,null,null,null,null,null,null,null,null,null,null,null,null,null,null,null,null,null,null,null,null,null,null,null,null,null,null,null,null,null,null,null,null,null,null,null,null,null,null,null,null,null,0,"","","","","","","","","","","","","","","","","","","","","","","","","","","","","","","","","","",null,null,null,null,null,"","","","","","","","",null,null,null,null,null,"","","","","","","","","",null,null,0,{"$f":"IF(Z224<>\"新規\",\"\",IF(AI224=3,基本!$E$14,IF(OR(AI224=1,AI224=2),基本!$E$13,\"\")))","v":""},{"$f":"IF(CF224=0,\"\",IF(AI224=3,基本!$E$16*CF224,IF(OR(AI224=1,AI224=2),基本!$E$15*CF224)))","v":""},{"$f":"IF(AJ224=\"\",\"\",IF(AJ224>0,基本!$E$17*CF224))","v":""},{"$f":"IF(ER224=0,\"\",IF(AM224<=4,基本!$E$18*ER224,IF(AM224>4,基本!$E$19*ER224)))","v":""},{"$f":"IF(AC224=\"\",\"\",IF(AC224>=1,基本!$E$20))","v":""},0,"","","","","","","",null,null,null,null,null,null,null,null,null,null,null,null,null,null,null,null,null,null,null,null,null,null,null,null,null,null,null,null,null,null,null,null,null,null,null,null,null,null,null,null,null,null,null,null,null,null,null,null,null,null,null,null,null,"","","","","","","","","","","","","","","","","","","","","","","","","","","","","","","","","","","","","","",null,null,"","","","","","","","","","","","","","","","","","","","","","","","","","","","",""]
[216,null,null,null,null,null,null,null,null,null,null,null,null,null,null,null,null,null,null,null,null,null,null,null,null,null,null,null,null,null,null,null,null,null,null,null,null,null,null,null,null,null,null,null,null,null,null,null,null,null,null,null,null,null,null,null,null,null,null,null,null,null,null,null,null,null,null,null,null,null,null,null,null,null,null,null,null,null,null,null,null,null,null,0,"","","","","","","","","","","","","","","","","","","","","","","","","","","","","","","","","","",null,null,null,null,null,"","","","","","","","",null,null,null,null,null,"","","","","","","","","",null,null,0,{"$f":"IF(Z225<>\"新規\",\"\",IF(AI225=3,基本!$E$14,IF(OR(AI225=1,AI225=2),基本!$E$13,\"\")))","v":""},{"$f":"IF(CF225=0,\"\",IF(AI225=3,基本!$E$16*CF225,IF(OR(AI225=1,AI225=2),基本!$E$15*CF225)))","v":""},{"$f":"IF(AJ225=\"\",\"\",IF(AJ225>0,基本!$E$17*CF225))","v":""},{"$f":"IF(ER225=0,\"\",IF(AM225<=4,基本!$E$18*ER225,IF(AM225>4,基本!$E$19*ER225)))","v":""},{"$f":"IF(AC225=\"\",\"\",IF(AC225>=1,基本!$E$20))","v":""},0,"","","","","","","",null,null,null,null,null,null,null,null,null,null,null,null,null,null,null,null,null,null,null,null,null,null,null,null,null,null,null,null,null,null,null,null,null,null,null,null,null,null,null,null,null,null,null,null,null,null,null,null,null,null,null,null,null,"","","","","","","","","","","","","","","","","","","","","","","","","","","","","","","","","","","","","","",null,null,"","","","","","","","","","","","","","","","","","","","","","","","","","","","",""]
[217,null,null,null,null,null,null,null,null,null,null,null,null,null,null,null,null,null,null,null,null,null,null,null,null,null,null,null,null,null,null,null,null,null,null,null,null,null,null,null,null,null,null,null,null,null,null,null,null,null,null,null,null,null,null,null,null,null,null,null,null,null,null,null,null,null,null,null,null,null,null,null,null,null,null,null,null,null,null,null,null,null,null,0,"","","","","","","","","","","","","","","","","","","","","","","","","","","","","","","","","","",null,null,null,null,null,"","","","","","","","",null,null,null,null,null,"","","","","","","","","",null,null,0,{"$f":"IF(Z226<>\"新規\",\"\",IF(AI226=3,基本!$E$14,IF(OR(AI226=1,AI226=2),基本!$E$13,\"\")))","v":""},{"$f":"IF(CF226=0,\"\",IF(AI226=3,基本!$E$16*CF226,IF(OR(AI226=1,AI226=2),基本!$E$15*CF226)))","v":""},{"$f":"IF(AJ226=\"\",\"\",IF(AJ226>0,基本!$E$17*CF226))","v":""},{"$f":"IF(ER226=0,\"\",IF(AM226<=4,基本!$E$18*ER226,IF(AM226>4,基本!$E$19*ER226)))","v":""},{"$f":"IF(AC226=\"\",\"\",IF(AC226>=1,基本!$E$20))","v":""},0,"","","","","","","",null,null,null,null,null,null,null,null,null,null,null,null,null,null,null,null,null,null,null,null,null,null,null,null,null,null,null,null,null,null,null,null,null,null,null,null,null,null,null,null,null,null,null,null,null,null,null,null,null,null,null,null,null,"","","","","","","","","","","","","","","","","","","","","","","","","","","","","","","","","","","","","","",null,null,"","","","","","","","","","","","","","","","","","","","","","","","","","","","",""]
[218,null,null,null,null,null,null,null,null,null,null,null,null,null,null,null,null,null,null,null,null,null,null,null,null,null,null,null,null,null,null,null,null,null,null,null,null,null,null,null,null,null,null,null,null,null,null,null,null,null,null,null,null,null,null,null,null,null,null,null,null,null,null,null,null,null,null,null,null,null,null,null,null,null,null,null,null,null,null,null,null,null,null,{"$f":"COUNTA(BA227:CE227)","v":0},{"$f":"IF(K227=0,\"\",K227)","v":""},{"$f":"IF(G227=0,\"\",G227)","v":""},{"$f":"IF(LEN(CH227)=0,\"\",LEN(CH227))","v":""},{"$f":"IF(CI227=2,LEFT(CH227),\"\")","v":""},{"$f":"IF(CH227=\"\",\"\",RIGHT(CH227))","v":""},{"$f":"IF(H227=0,\"\",H227)","v":""},{"$f":"IF(LEN(CL227)=0,\"\",LEN(CL227))","v":""},{"$f":"IF(CM227=3,LEFT(CL227),\"\")","v":""},{"$f":"IF(CM227=3,MID(CL227,2,1),IF(CM227=2,LEFT(CL227),\"\"))","v":""},{"$f":"RIGHT(CL227)","v":""},{"$f":"IF(I227=0,\"\",I227)","v":""},{"$f":"IF(LEN(CQ227)=0,\"\",LEN(CQ227))","v":""},{"$f":"IF(CR227=7,LEFT(CQ227),\"\")","v":""},{"$f":"IF(CR227=6,MID(CQ227,2,1),IF(CR227=5,LEFT(CQ227),\"\"))","v":""},{"$f":"IF(CR227=6,MID(CQ227,3,1),IF(CR227=5,MID(CQ227,2,1),IF(CR227=4,LEFT(CQ227),\"\")))","v":""},{"$f":"IF(CR227=6,MID(CQ227,4,1),IF(CR227=5,MID(CQ227,3,1),IF(CR227=4,MID(CQ227,2,1),IF(CR227=3,LEFT(CQ227),\"\"))))","v":""},{"$f":"IF(CR227=6,MID(CQ227,5,1),IF(CR227=5,MID(CQ227,4,1),IF(CR227=4,MID(CQ227,3,1),IF(CR227=3,MID(CQ227,2,1),IF(CR227=2,LEFT(CQ227),\"\")))))","v":""},{"$f":"IF(RIGHT(CR227)=0,\"\",RIGHT(CQ227))","v":""},{"$f":"IF(T227=0,\"\",T227)","v":""},{"$f":"LEFT(CY227)","v":""},{"$f":"MID(CY227,2,2)","v":""},{"$f":"MID(CY227,5,2)","v":""},{"$f":"MID(CY227,8,2)","v":""},"",{"$f":"IF(DD227=\"\",\"\",DD227+DA227)","v":""},{"$f":"IF(DD227=\"\",\"\",DATE(DE227,DB227,DC227))","v":""},{"$f":"IF(DD227=\"\",\"\",DATEDIF(DF227,TODAY(),\"Y\"))","v":""},{"$f":"LEFT(DG227)","v":""},{"$f":"MID(DG227,2,1)","v":""},{"$f":"MID(DG227,3,1)","v":""},{"$f":"MID(DG227,5,1)","v":""},{"$f":"MID(DG227,6,1)","v":""},{"$f":"MID(DG227,7,1)","v":""},{"$f":"MID(DG227,8,1)","v":""},null,null,null,null,null,{"$f":"IF(Y227=0,\"\",Y227)","v":""},{"$f":"LEFT(DT227)","v":""},{"$f":"MID(DT227,2,2)","v":""},{"$f":"MID(DT227,5,2)","v":""},{"$f":"MID(DT227,8,2)","v":""},{"$f":"IF(DW227=\"\",\"\",VALUE(DW227))","v":""},{"$f":"IF(DV227=\"\",\"\",IF(VALUE(DV227)=$CW$6,IF(VALUE(DW227)=$CW$5,DX227,1),1))","v":""},{"$f":"IF(DV227=\"\",\"\",$CZ$5)","v":""},null,null,null,null,null,{"$f":"IF(DZ227=1,0,LEFT(DZ227))","v":""},{"$f":"IF(DZ227=1,1,RIGHT(DZ227))","v":""},{"$f":"LEFT(EA227)","v":""},{"$f":"MID(EA227,2,1)","v":""},{"$f":"IF(W227=0,\"\",W227)","v":""},{"$f":"IF(EK227=\"不詳\",\"\",IF(EK227=\"不明\",\"\",MID(EK227,2,2)))","v":""},{"$f":"MID(EK227,5,2)","v":""},{"$f":"MID(EK227,8,2)","v":""},{"$f":"LEFT(EK227)","v":""},null,null,{"$f":"COUNTIF(BA227:CE227,\"◎\")","v":0},{"$f":"IF(Z227<>\"新規\",\"\",IF(AI227=3,基本!$E$14,IF(OR(AI227=1,AI227=2),基本!$E$13,\"\")))","v":""},{"$f":"IF(CF227=0,\"\",IF(AI227=3,基本!$E$16*CF227,IF(OR(AI227=1,AI227=2),基本!$E$15*CF227)))","v":""},{"$f":"IF(AJ227=\"\",\"\",IF(AJ227>0,基本!$E$17*CF227))","v":""},{"$f":"IF(ER227=0,\"\",IF(AM227<=4,基本!$E$18*ER227,IF(AM227>4,基本!$E$19*ER227)))","v":""},{"$f":"IF(AC227=\"\",\"\",IF(AC227>=1,基本!$E$20))","v":""},{"$f":"SUM(ES227:EW227)","v":0},"","","","","","","",null,null,null,null,null,null,null,null,null,null,null,null,null,null,null,null,null,null,null,null,null,null,null,null,null,null,null,null,null,null,null,null,null,null,null,null,null,null,null,null,null,null,null,null,null,null,null,null,null,null,null,null,null,{"$f":"IF(AT227=0,\"\",AT227)","v":""},{"$f":"LEFT(HG227,1)","v":""},{"$f":"MID(HG227,2,2)","v":""},{"$f":"MID(HG227,5,2)","v":""},{"$f":"MID(HG227,8,2)","v":""},{"$f":"IF(LEFT(V227,3)=\"神経痛\",1,IF(LEFT(V227,3)=\"リウマ\",2,IF(LEFT(V227,3)=\"頚腕症\",3,IF(LEFT(V227,3)=\"五十肩\",4,IF(LEFT(V227,3)=\"腰痛症\",5,IF(LEFT(V227,3)=\"頚椎捻\",6,\"\"))))))","v":""},{"$f":"IF(OR(BA227=\"○\",BA227=\"◎\"),1,\"\")","v":""},{"$f":"IF(OR(BB227=\"○\",BB227=\"◎\"),2,\"\")","v":""},{"$f":"IF(OR(BC227=\"○\",BC227=\"◎\"),3,\"\")","v":""},{"$f":"IF(OR(BD227=\"○\",BD227=\"◎\"),4,\"\")","v":""},{"$f":"IF(OR(BE227=\"○\",BE227=\"◎\"),5,\"\")","v":""},{"$f":"IF(OR(BF227=\"○\",BF227=\"◎\"),6,\"\")","v":""},{"$f":"IF(OR(BG227=\"○\",BG227=\"◎\"),7,\"\")","v":""},{"$f":"IF(OR(BH227=\"○\",BH227=\"◎\"),8,\"\")","v":""},{"$f":"IF(OR(BI227=\"○\",BI227=\"◎\"),9,\"\")","v":""},{"$f":"IF(OR(BJ227=\"○\",BJ227=\"◎\"),10,\"\")","v":""},{"$f":"IF(OR(BK227=\"○\",BK227=\"◎\"),11,\"\")","v":""},{"$f":"IF(OR(BL227=\"○\",BL227=\"◎\"),12,\"\")","v":""},{"$f":"IF(OR(BM227=\"○\",BM227=\"◎\"),13,\"\")","v":""},{"$f":"IF(OR(BN227=\"○\",BN227=\"◎\"),14,\"\")","v":""},{"$f":"IF(OR(BO227=\"○\",BO227=\"◎\"),15,\"\")","v":""},{"$f":"IF(OR(BP227=\"○\",BP227=\"◎\"),16,\"\")","v":""},{"$f":"IF(OR(BQ227=\"○\",BQ227=\"◎\"),17,\"\")","v":""},{"$f":"IF(OR(BR227=\"○\",BR227=\"◎\"),18,\"\")","v":""},{"$f":"IF(OR(BS227=\"○\",BS227=\"◎\"),19,\"\")","v":""},{"$f":"IF(OR(BT227=\"○\",BT227=\"◎\"),20,\"\")","v":""},{"$f":"IF(OR(BU227=\"○\",BU227=\"◎\"),21,\"\")","v":""},{"$f":"IF(OR(BV227=\"○\",BV227=\"◎\"),22,\"\")","v":""},{"$f":"IF(OR(BW227=\"○\",BW227=\"◎\"),23,\"\")","v":""},{"$f":"IF(OR(BX227=\"○\",BX227=\"◎\"),24,\"\")","v":""},{"$f":"IF(OR(BY227=\"○\",BY227=\"◎\"),25,\"\")","v":""},{"$f":"IF(OR(BZ227=\"○\",BZ227=\"◎\"),26,\"\")","v":""},{"$f":"IF(OR(CA227=\"○\",CA227=\"◎\"),27,\"\")","v":""},{"$f":"IF(OR(CB227=\"○\",CB227=\"◎\"),28,\"\")","v":""},{"$f":"IF(OR(CC227=\"○\",CC227=\"◎\"),29,\"\")","v":""},{"$f":"IF(OR(CD227=\"○\",CD227=\"◎\"),30,\"\")","v":""},{"$f":"IF(OR(CE227=\"○\",CE227=\"◎\"),31,\"\")","v":""},{"$f":"IF(MAX(HM227:IQ227)=0,\"\",MAX(HM227:IQ227))","v":""},null,null,{"$f":"IF(G227=\"\",\"\",G227)","v":""},{"$f":"IF(LEN(IU227)=0,\"\",LEN(IU227))","v":""},{"$f":"IF(IV227=8,LEFT(IU227),\"\")","v":""},{"$f":"IF(IV227=8,MID(IU227,2,1),IF(IV227=7,LEFT(IU227),\"\"))","v":""},{"$f":"IF(IV227=8,MID(IU227,3,1),IF(IV227=7,MID(IU227,2,1),IF(IV227=6,LEFT(IU227),\"\")))","v":""},{"$f":"IF(IV227=8,MID(IU227,4,1),IF(IV227=7,MID(IU227,3,1),IF(IV227=6,MID(IU227,2,1),IF(IV227=5,LEFT(IU227),\"\"))))","v":""},{"$f":"IF(IV227=8,MID(IU227,5,1),IF(IV227=7,MID(IU227,4,1),IF(IV227=6,MID(IU227,3,1),IF(IV227=5,MID(IU227,2,1),IF(IV227=4,LEFT(IU227),\"\")))))","v":""},{"$f":"IF(IV227=8,MID(IU227,6,1),IF(IV227=7,MID(IU227,5,1),IF(IV227=6,MID(IU227,4,1),IF(IV227=5,MID(IU227,3,1),IF(IV227=4,MID(IU227,2,1),IF(IV227=3,LEFT(IU227),\"\"))))))","v":""},{"$f":"IF(IV227=8,MID(IU227,7,1),IF(IV227=7,MID(IU227,6,1),IF(IV227=6,MID(IU227,5,1),IF(IV227=5,MID(IU227,4,1),IF(IV227=4,MID(IU227,3,1),IF(IV227=3,MID(IU227,2,1),IF(IV227=2,LEFT(IU227),\"\")))))))","v":""},{"$f":"IF(RIGHT(IV227)=0,\"\",RIGHT(IU227))","v":""},{"$f":"IF(H227=\"\",\"\",H227)","v":""},{"$f":"IF(LEN(JE227)=0,\"\",LEN(JE227))","v":""},{"$f":"IF(JF227=7,LEFT(JE227),\"\")","v":""},{"$f":"IF(JF227=7,MID(JE227,2,1),IF(JF227=6,LEFT(JE227),\"\"))","v":""},{"$f":"IF(JF227=7,MID(JE227,3,1),IF(JF227=6,MID(JE227,2,1),IF(JF227=5,LEFT(JE227,1),\"\")))","v":""},{"$f":"IF(JF227=7,MID(JE227,4,1),IF(JF227=6,MID(JE227,3,1),IF(JF227=5,MID(JE227,2,1),IF(JF227=4,LEFT(JE227,1),\"\"))))","v":""},{"$f":"IF(JF227=7,MID(JE227,5,1),IF(JF227=6,MID(JE227,4,1),IF(JF227=5,MID(JE227,3,1),IF(JF227=4,MID(JE227,2,1),IF(JF227=3,LEFT(JE227,1),\"\")))))","v":""},{"$f":"IF(JF227=7,MID(JE227,6,1),IF(JF227=6,MID(JE227,5,1),IF(JF227=5,MID(JE227,4,1),IF(JF227=4,MID(JE227,3,1),IF(JF227=3,MID(JE227,2,1),\"\")))))","v":""},{"$f":"IF(RIGHT(JE227)=0,\"\",RIGHT(JE227))","v":""},{"$f":"IF(B227=\"\",\"\",B227)","v":""},{"$f":"IF(LEN(JN227)=0,\"\",LEN(JN227))","v":""},{"$f":"IF(JO227=8,LEFT(JN227),\"\")","v":""},{"$f":"IF(JO227=8,MID(JN227,2,1),IF(JO227=7,LEFT(JN227),\"\"))","v":""},{"$f":"IF(JO227=8,MID(JN227,3,1),IF(JO227=7,MID(JN227,2,1),IF(JO227=6,LEFT(JN227),\"\")))","v":""},{"$f":"IF(JO227=8,MID(JN227,4,1),IF(JO227=7,MID(JN227,3,1),IF(JO227=6,MID(JN227,2,1),IF(JO227=5,LEFT(JN227),\"\"))))","v":""},"",{"$f":"IF(JO227=8,MID(JN227,6,1),IF(JO227=7,MID(JN227,5,1),IF(JO227=6,MID(JN227,4,1),IF(JO227=5,MID(JN227,3,1),IF(JO227=4,MID(JN227,2,1),IF(JO227=3,LEFT(JN227),\"\"))))))","v":""},{"$f":"IF(JO227=8,MID(JN227,7,1),IF(JO227=7,MID(JN227,6,1),IF(JO227=6,MID(JN227,5,1),IF(JO227=5,MID(JN227,4,1),IF(JO227=4,MID(JN227,3,1),IF(JO227=3,MID(JN227,2,1),IF(JO227=2,LEFT(JN227),\"\")))))))","v":""},{"$f":"IF(RIGHT(JO227)=0,\"\",RIGHT(JN227))","v":""}]
[219,null,null,null,null,null,null,null,null,null,null,null,null,null,null,null,null,null,null,null,null,null,null,null,null,null,null,null,null,null,null,null,null,null,null,null,null,null,null,null,null,null,null,null,null,null,null,null,null,null,null,null,null,null,null,null,null,null,null,null,null,null,null,null,null,null,null,null,null,null,null,null,null,null,null,null,null,null,null,null,null,null,null,0,"","","","","","","","","","","","","","","","","","","","","","","","","","","","","","","","","","",null,null,null,null,null,"","","","","","","","",null,null,null,null,null,"","","","","","","","","",null,null,0,{"$f":"IF(Z228<>\"新規\",\"\",IF(AI228=3,基本!$E$14,IF(OR(AI228=1,AI228=2),基本!$E$13,\"\")))","v":""},{"$f":"IF(CF228=0,\"\",IF(AI228=3,基本!$E$16*CF228,IF(OR(AI228=1,AI228=2),基本!$E$15*CF228)))","v":""},{"$f":"IF(AJ228=\"\",\"\",IF(AJ228>0,基本!$E$17*CF228))","v":""},{"$f":"IF(ER228=0,\"\",IF(AM228<=4,基本!$E$18*ER228,IF(AM228>4,基本!$E$19*ER228)))","v":""},{"$f":"IF(AC228=\"\",\"\",IF(AC228>=1,基本!$E$20))","v":""},0,"","","","","","","",null,null,null,null,null,null,null,null,null,null,null,null,null,null,null,null,null,null,null,null,null,null,null,null,null,null,null,null,null,null,null,null,null,null,null,null,null,null,null,null,null,null,null,null,null,null,null,null,null,null,null,null,null,"","","","","","","","","","","","","","","","","","","","","","","","","","","","","","","","","","","","","","",null,null,"","","","","","","","","","","","","","","","","","","","","","","","","","","","",""]
[220]
[221]
[222]
[223]
[224]
[225]
[226]
[227]
[228]
[229]
[230]
[231]
[232]
[233]
[234]
[235]
[236]
[237]
[238]
[239]
[240]
[241]
[242]
[243]
[244]
[245]
[246]
[247]
[248]
[249]
[250]
[251]
[252]
[253]
[254]
[255]
[256]
[257]
[258]
[259]
[260]
[261]
[262]
[263]
[264]
[265]
[266]
[267]
[268]
[269]
[270]
[271]
[272]
[273]
[274]
[275]
[276]
[277]
[278]
[279]
[280]
[281]
[282]
[283]
[284]
[285]
[286]
[287]
[288]
[289]
[290]
[291]
[292]
[293]
[294]
[295]
[296]
[297]
[298]
[299]
[300]
[301]

{"sheet":"申請書","index":1,"n_rows":102,"n_cols":125,"rows_kept":102,"cut":false,"hidden":false,"merged":[[101,4,101,82],[63,3,63,27],[13,12,13,16],[13,18,13,35],[22,31,23,32],[22,33,23,35],[16,33,17,34],[26,29,27,39],[43,22,44,30],[42,14,42,16],[26,26,27,28],[14,15,17,32],[35,33,36,40],[43,31,44,31],[18,31,19,32],[18,33,19,35],[22,24,23,27],[22,28,23,30],[18,17,19,17],[18,18,19,19],[24,18,25,22],[30,21,31,23],[24,26,25,28],[24,29,25,35],[20,1,55,2],[22,5,23,7],[22,8,23,10],[24,5,25,14],[24,15,25,17],[30,10,32,11],[30,15,31,16],[26,15,27,17],[54,15,54,16],[54,13,54,14],[43,5,44,17],[33,3,42,5],[41,8,42,10],[35,8,36,32],[22,18,23,20],[22,21,23,22],[22,11,23,12],[22,13,23,15],[22,16,23,17],[20,9,21,19],[4,1,5,15],[6,19,8,21],[6,1,8,15],[33,8,34,32],[9,1,9,15],[9,25,9,27],[9,19,9,21],[11,1,19,2],[9,34,9,36],[9,28,9,30],[9,31,9,33],[18,20,19,20],[18,21,19,22],[6,22,8,24],[9,22,9,24],[12,17,12,29],[12,30,12,38],[11,5,11,36],[18,14,19,14],[6,37,8,39],[14,36,19,41],[22,36,23,37],[26,40,27,42],[12,4,12,15],[22,38,23,39],[26,18,27,24],[18,25,19,26],[18,27,19,28],[18,29,19,30],[14,46,15,78],[22,44,23,46],[18,12,19,13],[18,15,19,16],[14,33,15,34],[26,78,27,81],[20,35,21,49],[24,40,25,42],[22,52,23,54],[22,40,23,41],[22,50,23,51],[22,47,23,49],[4,37,5,39],[4,41,7,46],[4,65,5,66],[9,16,9,18],[9,40,9,58],[12,43,12,45],[12,48,12,50],[9,37,9,39],[18,23,19,24],[13,36,13,41],[7,48,7,52],[4,48,5,50],[4,74,5,76],[41,62,42,64],[4,63,5,64],[4,56,5,58],[4,67,5,69],[30,62,32,64],[33,69,34,78],[33,62,34,64],[33,55,34,61],[4,77,5,79],[7,53,7,58],[33,43,34,44],[30,55,32,61],[41,55,42,61],[37,62,38,64],[35,62,36,64],[26,66,27,69],[24,66,25,81],[30,67,32,80],[26,70,27,73],[26,74,27,77],[41,45,42,50],[35,53,36,54],[33,45,34,50],[33,51,34,52],[33,53,34,54],[24,43,25,53],[2,16,3,18],[4,16,5,18],[6,16,8,18],[4,19,5,21],[4,22,5,24],[4,25,5,27],[4,28,5,30],[4,31,5,33],[4,34,5,36],[6,34,8,36],[6,31,8,33],[6,28,8,30],[6,25,8,27],[2,1,3,15],[1,50,1,70],[0,38,0,40],[0,41,0,42],[41,53,42,54],[37,53,38,54],[51,62,52,64],[47,53,47,54],[47,55,47,61],[37,55,38,61],[13,42,13,75],[12,59,12,76],[9,62,9,64],[9,65,9,67],[43,55,44,61],[43,45,44,50],[43,51,44,52],[45,43,46,44],[45,53,46,54],[45,55,46,61],[37,45,38,50],[37,51,38,52],[2,74,3,82],[4,80,5,82],[62,3,62,27],[76,6,77,15],[76,17,77,27],[0,51,0,69],[2,19,3,21],[2,22,3,24],[2,25,3,27],[2,28,3,30],[2,31,3,33],[2,34,3,36],[2,37,3,39],[2,63,3,64],[2,67,3,69],[2,51,3,53],[2,56,3,58],[0,13,0,32],[0,34,0,37],[2,41,3,46],[2,59,3,60],[2,65,3,66],[2,48,3,50],[0,43,0,45],[0,46,0,50],[1,22,1,38],[82,20,83,41],[85,56,86,58],[85,59,86,60],[82,42,83,60],[78,59,81,61],[56,42,57,51],[56,52,57,81],[67,44,67,51],[68,42,69,79],[63,70,63,80],[63,62,63,64],[63,66,63,69],[62,42,62,62],[78,68,81,81],[65,5,66,79],[67,8,68,10],[67,11,68,14],[67,15,68,16],[67,17,68,20],[67,21,68,22],[67,23,68,26],[60,27,61,28],[68,35,69,41],[63,30,63,37],[70,42,71,57],[70,62,71,64],[70,66,71,69],[70,70,71,81],[85,46,86,48],[85,49,86,50],[82,61,83,73],[78,50,81,52],[89,50,90,52],[89,53,90,56],[89,57,90,58],[89,59,90,62],[89,63,90,64],[89,65,90,68],[89,69,90,70],[78,62,81,64],[78,65,81,67],[74,50,76,79],[76,31,77,36],[76,39,77,44],[89,2,90,49],[74,31,75,36],[78,53,81,55],[98,2,98,81],[91,4,92,12],[91,13,92,16],[91,19,92,39],[91,40,92,46],[91,47,92,52],[82,1,87,2],[82,74,83,81],[84,61,87,73],[85,74,87,81],[85,51,86,53],[85,54,86,55],[84,20,87,41],[85,43,86,45],[82,5,83,19],[91,53,91,82],[84,7,87,19],[93,47,94,52],[78,15,81,38],[99,2,99,81],[100,2,100,84],[72,6,73,15],[72,30,73,37],[72,48,73,60],[74,6,75,15],[74,17,75,27],[67,27,68,28],[67,39,67,40],[67,42,67,43],[78,39,81,46],[78,56,81,58],[70,35,71,41],[80,5,81,14],[78,5,79,14],[78,47,81,49],[74,39,75,44],[93,53,94,75],[93,35,94,36],[93,77,94,78],[92,53,92,82],[93,4,94,12],[93,13,94,16],[93,19,94,33],[43,53,44,54],[42,23,42,25],[41,51,42,52],[37,41,38,42],[41,33,42,40],[43,33,44,40],[37,8,38,32],[37,33,38,40],[35,55,36,61],[35,43,36,44],[35,45,36,50],[35,51,36,52],[37,43,38,44],[41,43,42,44],[54,64,54,65],[54,66,54,67],[47,62,47,64],[48,55,48,61],[48,62,48,64],[54,62,54,63],[49,62,50,64],[54,60,54,61],[41,41,42,42],[43,43,44,44],[36,67,44,80],[45,45,46,50],[45,51,46,52],[45,41,46,42],[54,44,54,45],[54,48,54,49],[54,58,54,59],[54,72,54,73],[54,70,54,71],[54,68,54,69],[45,62,46,64],[43,62,44,64],[35,41,36,42],[43,41,44,42],[9,88,13,92],[9,106,11,107],[9,108,11,110],[17,114,18,115],[23,106,25,107],[23,108,25,110],[24,55,25,57],[23,113,25,114],[23,111,25,112],[22,68,23,72],[22,76,23,79],[20,61,21,65],[20,66,21,81],[22,61,23,63],[22,64,23,65],[18,61,19,69],[24,58,25,62],[19,108,20,111],[15,114,16,115],[22,55,23,56],[22,57,23,59],[63,42,63,60],[56,5,57,41],[60,42,61,78],[60,15,61,16],[54,30,54,31],[54,5,54,12],[54,24,54,25],[54,18,54,19],[54,20,54,21],[54,22,54,23],[54,52,54,53],[54,54,54,55],[54,56,54,57],[54,46,54,47],[54,50,54,51],[54,28,54,29],[54,32,54,33],[63,38,63,41],[60,30,61,36],[62,38,62,41],[60,17,61,20],[60,21,61,22],[60,23,61,26],[54,34,54,35],[54,38,54,39],[49,29,50,30],[45,5,46,20],[47,51,47,52],[47,26,47,28],[47,3,47,20],[47,24,47,25],[47,43,47,44],[47,45,47,50],[51,48,52,61],[49,48,50,61],[49,25,50,27],[49,28,50,28],[47,21,47,23],[45,33,46,40],[45,22,46,30],[47,29,47,32],[60,8,61,10],[60,11,61,14],[54,26,54,27],[60,38,61,41],[58,6,59,37],[9,116,9,122],[9,114,9,115],[9,80,9,82],[12,106,13,107],[9,77,9,79],[9,74,9,76],[9,71,9,73],[9,68,9,70],[12,108,13,110],[13,116,14,119],[14,80,15,81],[15,106,16,107],[16,42,17,70],[17,116,18,119],[12,40,12,42],[12,53,12,55],[11,114,12,115],[9,59,9,61],[54,36,54,37],[13,120,14,121],[11,39,11,56],[11,58,11,68],[18,42,19,50],[18,51,19,60],[54,95,55,105],[52,95,53,105],[11,116,12,119],[37,108,38,111],[35,106,36,107],[35,108,36,111],[19,112,20,127],[29,120,31,122],[37,106,38,107],[33,106,34,107],[33,108,34,111],[13,124,14,125],[13,122,14,123],[27,108,30,111],[27,114,28,115],[19,106,20,107],[15,108,16,111],[15,116,16,119],[54,74,54,75],[29,116,31,119],[29,114,31,115],[27,106,30,107],[13,114,14,115],[56,1,63,2],[64,1,71,2],[72,1,81,2],[33,33,34,40],[33,41,34,42],[70,5,71,28],[48,8,48,28],[47,33,47,40],[54,80,54,81],[54,76,54,77],[54,78,54,79],[47,41,47,42],[49,8,50,16],[49,17,50,18],[49,19,50,21],[49,22,50,24],[54,40,54,41],[54,42,54,43],[51,6,52,31],[27,116,28,119]]}
[null,null,null,null,null,null,null,null,null,null,null,null,null,"療養費支給申請書（",null,null,null,null,null,null,null,null,null,null,null,null,null,null,null,null,null,null,null,null,"令和",null,null,null,{"$f":"IF(基本!I5=\"平成\",\"31\",記入!CW6)","v":4},null,null,"年",null,{"$f":"記入!CW5","v":10},null,null,"月分）",null,null,null,null,"（はり・きゅう用）"]
[null,null,null,null,null,null,null,null,null,null,null,null,null,null,null,null,null,null,null,null,null,null,{"$f":"IF(DC20=\"\",\"\",IF(DC20=\"高\",基本!C9,IF(DC20=\"国\",基本!C9,IF(DC20=\"退\",基本!C9,\"\"))))","v":"4081600477"}]
[null,"公費負担者番号",null,null,null,null,null,null,null,null,null,null,null,null,null,null,null,null,null,null,null,null,null,null,null,null,null,null,null,null,null,null,null,null,null,null,null,null,null,null,null,"特記事項",null,null,null,null,null,null,null,null,null,{"$f":"IF(OR(INDEX(データ記入,$CK$10,4)=\"国保組合\",INDEX(データ記入,$CK$10,4)=\"国保一般\",INDEX(データ記入,$CK$10,4)=\"協会けんぽ\",INDEX(データ記入,$CK$10,4)=\"健保組合\",INDEX(データ記入,$CK$10,4)=\"共済組合\"),\"○\",\"\")","v":""},null,null,null,null,{"$f":"IF(INDEX(データ記入,$CK$10,4)=\"後期高齢者\",\"○\",\"\")","v":"○"},null,null,null,null,null,null,{"$f":"IF(DC20=\"高\",\"\",IF(DH24=\"○\",\"○\",\"\"))","v":""},null,null,null,{"$f":"IF(OR(BL3=\"○\",BL5=\"○\"),\"\",IF(OR(DK12>=65,DC20=\"高\"),IF(OR(DC16=1,DC16=2),\"○\",\"\")))","v":"○"},null,null,null,null,null,null,"給付割合"]
[]
[null,"公費受給者番号",null,null,null,null,null,null,null,null,null,null,null,null,null,null,null,null,null,null,null,null,null,null,null,null,null,null,null,null,null,null,null,null,null,null,null,null,null,null,null,null,null,null,null,null,null,null,null,null,null,null,null,null,null,null,{"$f":"IF(INDEX(データ記入,$CK$10,4)=\"退職者国保\",\"○\",\"\")","v":""},null,null,null,null,null,null,{"$f":"IF(DC20=\"高\",\"\",IF(DJ24=\"○\",\"○\",\"\"))","v":""},null,null,null,{"$f":"IF(OR(BL3=\"○\",BL5=\"○\"),\"\",IF(OR(DK12>=65,DC20=\"高\"),IF(DC16=3,\"○\",\"\")))","v":""},null,null,null,null,null,null,{"$f":"IF(DC16=2,\"〇\",\"\")","v":"〇"},null,null,{"$f":"IF(DC16=1,\"〇\",\"\")","v":""},null,null,10,null,null,null,null,null,null,null,35]
[null,null,null,null,null,null,null,null,null,null,null,null,null,null,null,null,null,null,null,null,null,null,null,null,null,null,null,null,null,null,null,null,null,null,null,null,null,null,null,null,null,null,null,null,null,null,null,null,null,null,null,null,null,null,null,null,null,null,null,null,null,null,null,null,null,null,null,null,null,null,null,null,null,null,null,null,null,null,null,null,null,null,null,null,null,null,null,null,300]
[null,"区市町村 番号"]
[null,null,null,null,null,null,null,null,null,null,null,null,null,null,null,null,null,null,null,null,null,null,null,null,null,null,null,null,null,null,null,null,null,null,null,null,null,null,null,null,null,null,null,null,null,null,null,null,"種類",null,null,null,null,"05鍼灸"]
[]
[null,"受 給 者 番 号",null,null,null,null,null,null,null,null,null,null,null,null,null,null,null,null,null,null,null,null,null,null,null,null,null,null,null,null,null,null,null,null,null,null,null,null,null,null,"保険者番号",null,null,null,null,null,null,null,null,null,null,null,null,null,null,null,null,null,null,{"$f":"IF(INDEX(データ記入,$CK$10,275)=\"\",\"\",INDEX(データ記入,$CK$10,275))","v":"3"},null,null,{"$f":"IF(INDEX(データ記入,$CK$10,276)=\"\",\"\",INDEX(データ記入,$CK$10,276))","v":"9"},null,null,{"$f":"IF(INDEX(データ記入,$CK$10,277)=\"\",\"\",INDEX(データ記入,$CK$10,277))","v":"4"},null,null,{"$f":"IF(INDEX(データ記入,$CK$10,278)=\"\",\"\",INDEX(データ記入,$CK$10,278))","v":"0"},null,null,{"$f":"IF(INDEX(データ記入,$CK$10,279)=\"\",\"\",INDEX(データ記入,$CK$10,279))","v":"2"},null,null,{"$f":"IF(INDEX(データ記入,$CK$10,280)=\"\",\"\",INDEX(データ記入,$CK$10,280))","v":"0"},null,null,{"$f":"IF(INDEX(データ記入,$CK$10,281)=\"\",\"\",INDEX(データ記入,$CK$10,281))","v":"3"},null,null,{"$f":"IF(INDEX(データ記入,$CK$10,282)=\"\",\"\",INDEX(データ記入,$CK$10,282))","v":"7"},null,null,null,null,null,null,null,2,null,null,null,null,null,null,null,null,null,null,null,null,null,null,null,null,null,{"$f":"IF(INDEX(データ記入,$CK$10,46)=\"\",\"\",INDEX(データ記入,$CK$10,46))","v":"女"},null,"性別",null,null,null,null,null,{"$f":"IF(INDEX(データ記入,$CK$10,28)=\"\",\"\",INDEX(データ記入,$CK$10,28))","v":""},null,"施術報告書交付料"]
[]
[null,"被保険者欄",null,null,null,"〇被保険者証等の記号番号",null,null,null,null,null,null,null,null,null,null,null,null,null,null,null,null,null,null,null,null,null,null,null,null,null,null,null,null,null,null,null,null,null,"〇発病又は負傷年月日",null,null,null,null,null,null,null,null,null,null,null,null,null,null,null,null,null,null,"〇傷病名",null,null,null,null,null,null,null,null,null,null,null,null,null,null,null,null,null,null,null,null,null,null,null,null,null,null,null,null,null,null,null,null,null,null,null,null,null,null,null,null,null,null,null,null,null,null,null,null,null,null,null,null,null,null,null,{"$f":"IF(INDEX(データ記入,$CK$10,110)=0,\"\",INDEX(データ記入,$CK$10,110))","v":62},null,"年齢"]
[null,null,null,null,{"$f":"IF(INDEX(データ記入,$CK$10,6)=\"\",\"\",INDEX(データ記入,$CK$10,6))","v":""},null,null,null,null,null,null,null,null,null,null,null,null,{"$f":"IF(INDEX(データ記入,$CK$10,7)=\"\",\"\",INDEX(データ記入,$CK$10,7))","v":"12711848"},null,null,null,null,null,null,null,null,null,null,null,null,{"$f":"IF(INDEX(データ記入,$CK$10,11)=\"\",\"\",INDEX(データ記入,$CK$10,11))","v":""},null,null,null,null,null,null,null,null,null,{"$f":"IF(DC38=\"H\",\"平成\",\"令和\")","v":"令和"},null,null,{"$f":"IF(INDEX(データ記入,$CK$10,141)=\"\",\"\",INDEX(データ記入,$CK$10,141))","v":"04"},null,null,null,null,{"$f":"IF(INDEX(データ記入,$CK$10,142)=\"\",\"\",INDEX(データ記入,$CK$10,142))","v":"02"},null,null,null,null,{"$f":"IF(INDEX(データ記入,$CK$10,143)=\"\",\"\",INDEX(データ記入,$CK$10,143))","v":"11"},null,null,null,null,null,{"$f":"IF(INDEX(データ記入,$CK$10,21)=\"\",\"\",INDEX(データ記入,$CK$10,21))","v":"腰痛症"},null,null,null,null,null,null,null,null,null,null,null,null,null,null,null,null,null,null,null,null,null,null,null,null,null,null,null,null,null,null,null,null,null,null,null,null,null,null,null,null,null,null,null,null,null,null,{"$f":"IF(INDEX(データ記入,$CK$10,83)=0,\"\",INDEX(データ記入,$CK$10,83))","v":2},null,"日数"]
[null,null,null,null,null,null,null,null,null,null,null,null,"（フリガナ）",null,null,null,null,null,{"$f":"IF(INDEX(データ記入,$CK$10,18)=\"\",\"\",INDEX(データ記入,$CK$10,18))","v":"コウキハナコ"},null,null,null,null,null,null,null,null,null,null,null,null,null,null,null,null,null,"続　柄",null,null,null,null,null,"〇発症又は負傷の原因及びその経過",null,null,null,null,null,null,null,null,null,null,null,null,null,null,null,null,null,null,null,null,null,null,null,null,null,null,null,null,null,null,null,null,null,null,null,null,null,null,null,null,null,null,null,null,null,null,null,null,null,null,null,null,null,null,null,null,null,null,null,null,null,null,null,null,null,null,null,null,null,null,null,{"$f":"IF(INDEX(データ記入,$CK$10,34)=0,\"\",INDEX(データ記入,$CK$10,34))","v":3},null,"施術種別",null,null,null,{"$f":"IF($DK$14=1,\"○\",\"\")","v":""},null,{"$f":"IF($DK$14=2,\"○\",\"\")","v":""},null,{"$f":"IF($DK$14=3,\"○\",\"\")","v":"○"}]
[null,null,null,null,null,null,null,null,null,null,null,null,null,null,null,{"$f":"IF(INDEX(データ記入,$CK$10,17)=\"\",\"\",INDEX(データ記入,$CK$10,17))","v":"後期花子"},null,null,null,null,null,null,null,null,null,null,null,null,null,null,null,null,null,{"$f":"IF(INDEX(データ記入,$CK$10,47)=\"男\",\"○\",\"\")","v":""},null,null,{"$f":"IF(DC24=\"\",\"\",IF(DC24=\"本\",\"本人\",IF(DC24=\"家\",\"家族\",\"\")))","v":"本人"},null,null,null,null,null,null,null,null,null,{"$f":"IF(INDEX(データ記入,$CK$10,23)=\"\",\"\",INDEX(データ記入,$CK$10,23))","v":"原因不詳・経過良好"}]
[null,null,null,null,null,null,null,null,null,null,null,null,null,null,null,null,null,null,null,null,null,null,null,null,null,null,null,null,null,null,null,null,null,null,null,null,null,null,null,null,null,null,null,null,null,null,null,null,null,null,null,null,null,null,null,null,null,null,null,null,null,null,null,null,null,null,null,null,null,null,null,null,null,null,null,null,null,null,null,null,null,null,null,null,null,null,null,null,null,null,null,null,null,null,null,null,null,null,null,null,null,null,null,null,null,null,{"$f":"IF(INDEX(データ記入,$CK$10,8)=0,\"\",INDEX(データ記入,$CK$10,8))","v":2},null,"負担割合",null,null,null,null,null,{"$f":"IF(INDEX(データ記入,$CK$10,25)=0,\"\",INDEX(データ記入,$CK$10,25))","v":"継続"},null,"新規"]
[null,null,null,null,null,null,null,null,null,null,null,null,null,null,null,null,null,null,null,null,null,null,null,null,null,null,null,null,null,null,null,null,null,{"$f":"IF(INDEX(データ記入,$CK$10,47)=\"女\",\"○\",\"\")","v":"○"},null,null,null,null,null,null,null,null,"〇業務上・外、第三者行為の有無",null,null,null,null,null,null,null,null,null,null,null,null,null,null,null,null,null,null,null,null,null,null,null,null,null,null,null,null,null,null,null,null,null,null,null,null,null,null,null,null,null,null,null,null,null,null,null,null,null,null,null,null,null,null," "]
[null,null,null,null,null,null,null,null,null,null,null,null,null,null,null,null,null,null,null,null,null,null,null,null,null,null,null,null,null,null,null,null,null,null,null,null,null,null,null,null,null,null,null,null,null,null,null,null,null,null,null,null,null,null,null,null,null,null,null,null,null,null,null,null,null,null,null,null,null,null,null,null,null,null,null,null,null,null,null,null,null,null,null,null,null,null,null,null,null,null,null,null,null,null,null,null,null,null,null,null,null,null,null,null,null,null,null,null,null,null,null,null,null,null,{"$f":"IF(INDEX(データ記入,$CK$10,35)=0,\"\",INDEX(データ記入,$CK$10,35))","v":1},null,"電　療"]
[null,null,null,null,null,null,null,null,null,null,null,null,{"$f":"IF(INDEX(データ記入,$CK$10,103)=\"T\",\"○\",\"\")","v":""},null,null,{"$f":"IF(INDEX(データ記入,$CK$10,103)=\"S\",\"○\",\"\")","v":"○"},null,null,{"$f":"IF(INDEX(データ記入,$CK$10,103)=\"H\",\"○\",\"\")","v":""},null,null,{"$f":"IF(INDEX(データ記入,$CK$10,103)=\"R\",\"○\",\"\")","v":""},null,{"$f":"IF(INDEX(データ記入,$CK$10,104)=\"\",\"\",INDEX(データ記入,$CK$10,104))","v":"35"},null,"年",null,{"$f":"IF(INDEX(データ記入,$CK$10,105)=\"\",\"\",INDEX(データ記入,$CK$10,105))","v":"04"},null,"月",null,{"$f":"IF(INDEX(データ記入,$CK$10,106)=\"\",\"\",INDEX(データ記入,$CK$10,106))","v":"16"},null,"日生",null,null,null,null,null,null,null,null,"１．業務上",null,null,null,null,null,null,null,null,"2.第三者行為",null,null,null,null,null,null,null,null,null,"3.その他"]
[null,null,null,null,null,null,null,null,null,null,null,null,null,null,null,null,null,null,null,null,null,null,null,null,null,null,null,null,null,null,null,null,null,null,null,null,null,null,null,null,null,null,null,null,null,null,null,null,null,null,null,null,null,null,null,null,null,null,null,null,null,null,null,null,null,null,null,null,null,null,null,null,null,null,null,null,null,null,null,null,null,null,null,null,null,null,null,null,null,null,null,null,null,null,null,null,null,null,null,null,null,null,null,null,null,null,{"$f":"IF(INDEX(データ記入,$CK$10,4)=\"\",\"\",IF(INDEX(データ記入,$CK$10,4)=\"後期高齢者\",\"高\",IF(INDEX(データ記入,$CK$10,4)=\"国保一般\",\"国\",IF(INDEX(データ記入,$CK$10,4)=\"退職者国保\",\"退\",\"\"))))","v":"高"},null,"国保高齢",null,null,null,{"$f":"IF(DC20=\"\",\"\",IF(DC20=\"高\",\"福岡県後期高齢者医療広域連合コード\",IF(DC20=\"国\",\"福岡県国民健康保険団体連合コード\",IF(DC20=\"退\",\"福岡県国民健康保険団体連合コード\",\"\"))))","v":"福岡県後期高齢者医療広域連合コード"}]
[null,"施　術　内　容　欄",null,null,null,null,null,null,null,"初療年月日",null,null,null,null,null,null,null,null,null,null,null,null,null,null,null,null,null,null,null,null,null,null,null,null,null,"施術期間",null,null,null,null,null,null,null,null,null,null,null,null,null,null,null,null,null,null,null,null,null,null,null,null,null,"実日数",null,null,null,null,"請　　求　　区　　分"]
[]
[null,null,null,null,null,{"$f":"IF(DC34=\"H\",\"平成\",\"令和\")","v":"令和"},null,null,{"$f":"IF(INDEX(データ記入,$CK$10,125)=\"\",\"\",INDEX(データ記入,$CK$10,125))","v":"04"},null,null,"年",null,{"$f":"IF(INDEX(データ記入,$CK$10,126)=\"\",\"\",INDEX(データ記入,$CK$10,126))","v":"05"},null,null,"月",null,{"$f":"IF(INDEX(データ記入,$CK$10,127)=\"\",\"\",INDEX(データ記入,$CK$10,127))","v":"16"},null,null,"日",null,null,"令和",null,null,null,{"$f":"AM1","v":4},null,null,"年",null,{"$f":"AR1","v":10},null,null,"月",null,{"$f":"IF(BD31=\"\",1,IF(BD31>=1,S23,\"\"))","v":1},null,"日",null,null,null,"令和",null,null,{"$f":"AM1","v":4},null,null,"年",null,{"$f":"AR1","v":10},null,null,"月",null,{"$f":"記入!CZ5","v":31},null,null,null,{"$f":"IF(INDEX(データ記入,$CK$10,83)=0,\"\",INDEX(データ記入,$CK$10,83))","v":2},null,null,"日",null,null,null,{"$f":"IF(INDEX(データ記入,$CK$10,25)=\"新規\",\"○\",\"\")","v":""},null,null,null,null,null,null,null,{"$f":"IF(INDEX(データ記入,$CK$10,25)=\"継続\",\"○\",\"\")","v":"○"}]
[null,null,null,null,null,null,null,null,null,null,null,null,null,null,null,null,null,null,null,null,null,null,null,null,null,null,null,null,null,null,null,null,null,null,null,null,null,null,null,null,null,null,null,null,null,null,null,null,null,null,null,null,null,null,null,null,null,null,null,null,null,null,null,null,null,null,null,null,null,null,null,null,null,null,null,null,null,null,null,null,null,null,null,null,null,null,null,null,null,null,null,null,null,null,null,null,null,null,null,null,null,null,null,null,null,null,{"$f":"IF(INDEX(データ記入,$CK$10,5)=0,\"\",INDEX(データ記入,$CK$10,5))","v":"本"},null,"続柄",null,null,{"$f":"IF(DC24=\"本\",\"○\",\"\")","v":"○"},null,{"$f":"IF(DC24=\"家\",\"○\",\"\")","v":""}]
[null,null,null,null,null,"傷病名",null,null,null,null,null,null,null,null,null,{"$f":"IF(INDEX(データ記入,$CK$10,21)=\"神経痛\",\"○\",\"\")","v":""},null,null,"神経痛",null,null,null,null,null,null,null,{"$f":"IF(INDEX(データ記入,$CK$10,21)=\"リウマチ\",\"○\",\"\")","v":""},null,null,"リウマチ",null,null,null,null,null,null,null,null,null,null,{"$f":"IF(INDEX(データ記入,$CK$10,21)=\"頚腕症候群\",\"○\",\"\")","v":""},null,null,"頚腕症候群",null,null,null,null,null,null,null,null,null,null,null,{"$f":"IF(INDEX(データ記入,$CK$10,21)=\"五十肩\",\"○\",\"\")","v":""},null,null,"五十肩",null,null,null,null,null,null,null,"転　　　　　　　　帰"]
[]
[null,null,null,null,null,null,null,null,null,null,null,null,null,null,null,{"$f":"IF(INDEX(データ記入,$CK$10,21)=\"腰痛症\",\"○\",\"\")","v":"○"},null,null,"腰痛症",null,null,null,null,null,null,null,{"$f":"IF(INDEX(データ記入,$CK$10,21)=\"頚椎捻挫後遺症\",\"○\",\"\")","v":""},null,null,"頚椎捻挫後遺症",null,null,null,null,null,null,null,null,null,null,null,null,null,null,null,null,null,null,null,null,null,null,null,null,null,null,null,null,null,null,null,null,null,null,null,null,{"$f":"IF(INDEX(データ記入,$CK$10,51)=\"継続\",\"○\",\"\")","v":"○"},null,null,null,{"$f":"IF(INDEX(データ記入,$CK$10,51)=\"治癒\",\"○\",\"\")","v":""},null,null,null,{"$f":"IF(INDEX(データ記入,$CK$10,51)=\"中止\",\"○\",\"\")","v":""},null,null,null,{"$f":"IF(INDEX(データ記入,$CK$10,51)=\"転医\",\"○\",\"\")","v":""}]
[null,null,null,null,null,null,null,null,null,null,null,null,null,null,null,null,null,null,null,null,null,null,null,null,null,null,null,null,null,null,null,null,null,null,null,null,null,null,null,null,null,null,null,null,null,null,null,null,null,null,null,null,null,null,null,null,null,null,null,null,null,null,null,null,null,null,null,null,null,null,null,null,null,null,null,null,null,null,null,null,null,null,null,null,null,null,null,null,null,null,null,null,null,null,null,null,null,null,null,null,null,null,null,null,null,null,{"$f":"IF(INDEX(データ記入,$CK$10,25)=0,\"\",INDEX(データ記入,$CK$10,25))","v":"継続"},null,"新規・継続",null,null,null,null,null,null,null,"県別"]
[]
[null,null,null,null,null,null,null,null,null,null,null,null,null,null,null,null,null,null,null,null,null,null,null,null,null,null,null,null,null,null,null,null,null,null,null,null,null,null,null,null,null,null,null,null,null,null,null,null,null,null,null,null,null,null,null,null,null,null,null,null,null,null,null,null,null,null,null,null,null,null,null,null,null,null,null,null,null,null,null,null,null,null,null,null,null,null,null,null,null,null,null,null,null,null,null,null,null,null,null,null,null,null,null,null,null,null,null,null,null,null,null,null,null,null,{"$f":"IF(INDEX(データ記入,$CK$10,147)=\"\",\"\",INDEX(データ記入,$CK$10,147))","v":0},null,"往療日数",null,null,null,{"$f":"IF(INDEX(データ記入,$CK$10,38)=\"\",\"\",INDEX(データ記入,$CK$10,38))","v":""}]
[null,null,null,null,null,null,null,null,null,{"$f":"IF(AND(BL53=基本!E13,BC57<>\"\"),\"○\",\"\")","v":""},{"$f":"IF(AND(BD31=基本!E13,AT34<>\"\"),\"○\",\"\")","v":""},null,null,null,null,{"$f":"IF(AND(BD31=基本!E13,AT36<>\"\"),\"○\",\"\")","v":""},null,null,null,null,null,{"$f":"IF(AND(BD31=基本!E14,AT38<>\"\"),\"○\",\"\")","v":""},null,null,null,null,null,null,null,null,null,null,null,null,null,null,null,null,null,null,null,null,null,null,null,null,null,null,null,null,null,null,null,null,null,{"$f":"IF(DK16<>\"新規\",\"\",IF(AT38<>\"\",基本!E14,IF(OR(AT34<>\"\",AT36<>\"\"),基本!E13)))","v":""},null,null,null,null,null,null,"円"]
[]
[]
[null,null,null,"施術料",null,null,null,null,"　はり",null,null,null,null,null,null,null,null,null,null,null,null,null,null,null,null,null,null,null,null,null,null,null,null,{"$f":"IF(AT34=\"\",\"\",基本!E15)","v":""},null,null,null,null,null,null,null,"円",null,"×",null,{"$f":"IF(DK14=1,BJ23,\"\")","v":""},null,null,null,null,null,"回",null,"＝",null,{"$f":"IF(AT34=\"\",\"\",AH34*AT34)","v":""},null,null,null,null,null,null,"円",null,null,null,null,null,null,{"$f":"IF(INDEX(データ記入,$CK$10,27)=\"\",\"\",INDEX(データ記入,$CK$10,27))","v":""},null,null,null,null,null,null,null,null,null,null,null,null,null,null,null,null,null,null,null,null,null,null,null,null,null,null,null,null,null,null,null,null,null,null,null,null,{"$f":"IF(INDEX(データ記入,$CK$10,124)=0,\"\",INDEX(データ記入,$CK$10,124))","v":"R"},null,"初療年号"]
[]
[null,null,null,null,null,null,null,null,"　きゅう",null,null,null,null,null,null,null,null,null,null,null,null,null,null,null,null,null,null,null,null,null,null,null,null,{"$f":"IF(AT36=\"\",\"\",基本!E15)","v":""},null,null,null,null,null,null,null,"円",null,"×",null,{"$f":"IF(DK14=2,BJ23,\"\")","v":""},null,null,null,null,null,"回",null,"＝",null,{"$f":"IF(AT36=\"\",\"\",AH36*AT36)","v":""},null,null,null,null,null,null,"円",null,null,null,null,null,null,null,null,null,null,null,null,null,null,null,null,null,null,null,null,null,null,null,null,null,null,null,null,null,null,null,null,null,null,null,null,null,null,null,null,null,null,null,{"$f":"IF(INDEX(データ記入,$CK$10,215)=0,\"\",INDEX(データ記入,$CK$10,215))","v":"R"},null,"同意日"]
[null,null,null,null,null,null,null,null,null,null,null,null,null,null,null,null,null,null,null,null,null,null,null,null,null,null,null,null,null,null,null,null,null,null,null,null,null,null,null,null,null,null,null,null,null,null,null,null,null,null,null,null,null,null,null,null,null,null,null,null,null,null,null,null,null,null,null,{"$f":"IF(INDEX(データ記入,$CK$10,42)=\"\",\"\",INDEX(データ記入,$CK$10,42))","v":""}]
[null,null,null,null,null,null,null,null,"　はり・きゅう併用",null,null,null,null,null,null,null,null,null,null,null,null,null,null,null,null,null,null,null,null,null,null,null,null,{"$f":"IF(AT38=\"\",\"\",基本!E16)","v":1610},null,null,null,null,null,null,null,"円",null,"×",null,{"$f":"IF(DK14=3,BJ23,\"\")","v":2},null,null,null,null,null,"回",null,"＝",null,{"$f":"IF(AT38=\"\",\"\",AH38*AT38)","v":3220},null,null,null,null,null,null,"円",null,null,null,null,null,null,null,null,null,null,null,null,null,null,null,null,null,null,null,null,null,null,null,null,null,null,null,null,null,null,null,null,null,null,null,null,null,null,null,null,null,null,null,{"$f":"IF(INDEX(データ記入,$CK$10,144)=0,\"\",INDEX(データ記入,$CK$10,144))","v":"R"},null,"発病"]
[]
[]
[]
[null,null,null,null,null,null,null,null,{"$f":"IF(INDEX(データ記入,$CK$10,35)=1,\"○\",\"\")","v":"○"},null,null,null,null,null,null,null,null,null,null,null,null,null,null,null,null,null,null,null,null,null,null,null,null,{"$f":"IF(DC13=\"\",\"\",IF(INDEX(データ記入,$CK$10,35)=\"\",\"\",基本!E17))","v":34},null,null,null,null,null,null,null,"円",null,"×",null,{"$f":"IF(AH42=\"\",\"\",BJ23)","v":2},null,null,null,null,null,"回",null,"＝",null,{"$f":"IF(AT42=\"\",\"\",AH42*AT42)","v":68},null,null,null,null,null,null,"円"]
[null,null,null,null,null,null,null,null,null,null,null,null,null,null,{"$f":"IF(INDEX(データ記入,$CK$10,35)=2,\"○\",\"\")","v":""},null,null,null,null,null,null,null,null,{"$f":"IF(INDEX(データ記入,$CK$10,35)=3,\"○\",\"\")","v":""}]
[null,null,null,null,null,"　　 往療料　",null,null,null,null,null,null,null,null,null,null,null,null,null,null,null,null,"4ｋｍまで",null,null,null,null,null,null,null,null,null,null,{"$f":"IF(AT44=\"\",\"\",基本!E18)","v":""},null,null,null,null,null,null,null,"円",null,"×",null,{"$f":"IF(DK30=0,\"\",IF(DQ30<=4,INDEX(データ記入,$CK$10,147),\"\"))","v":""},null,null,null,null,null,"回",null,"＝",null,{"$f":"IF(AT44=\"\",\"\",AH44*AT44)","v":""},null,null,null,null,null,null,"円"]
[]
[null,null,null,null,null,"　　 往療料",null,null,null,null,null,null,null,null,null,null,null,null,null,null,null,null,"4ｋｍ超",null,null,null,null,null,null,null,null,null,null,{"$f":"IF(AT46=\"\",\"\",基本!E19)","v":""},null,null,null,null,null,null,null,"円",null,"×",null,{"$f":"IF(DK30=0,\"\",IF(DQ30>4,INDEX(データ記入,$CK$10,147),\"\"))","v":""},null,null,null,null,null,"回",null,"＝",null,{"$f":"IF(AT46=\"\",\"\",AH46*AT46)","v":""},null,null,null,null,null,null,"円"]
[]
[null,null,null,"施術報告書交付料（前回支給: ",null,null,null,null,null,null,null,null,null,null,null,null,null,null,null,null,null,{"$f":"IF(INDEX(データ記入,$CK$10,29)=\"\",\"\",INDEX(データ記入,$CK$10,29))","v":""},null,null,"年",null,{"$f":"IF(INDEX(データ記入,$CK$10,30)=\"\",\"\",INDEX(データ記入,$CK$10,30))","v":""},null,null,"月分）",null,null,null,{"$f":"IF(AT48=\"\",\"\",基本!E20)","v":""},null,null,null,null,null,null,null,"円",null,"×",null,{"$f":"IF(DK10=\"\",\"\",INDEX(データ記入,$CK$10,28))","v":""},null,null,null,null,null,"回",null,"＝",null,{"$f":"IF(AT48=\"\",\"\",AH48*AT48)","v":""},null,null,null,null,null,null,"円"]
[null,null,null,null,null,null,null,null,"合　　　　　　　　　　　計",null,null,null,null,null,null,null,null,null,null,null,null,null,null,null,null,null,null,null,null,null,null,null,null,null,null,null,null,null,null,null,null,null,null,null,null,null,null,null,null,null,null,null,null,null,null,{"$f":"SUM(BD30:BJ48)","v":3288},null,null,null,null,null,null,"円"]
[null,null,null,null,null,null,null,null,"一部負担金",null,null,null,null,null,null,null,null,"（",null,{"$f":"IF(INDEX(データ記入,$CK$10,8)=1,\"○\",\"\")","v":""},null,null,{"$f":"IF(INDEX(データ記入,$CK$10,8)=2,\"○\",\"\")","v":"○"},null,null,{"$f":"IF(INDEX(データ記入,$CK$10,8)=3,\"○\",\"\")","v":""},null,null,null,"）",null,null,null,null,null,null,null,null,null,null,null,null,null,null,null,null,null,null,{"$f":"IF(BD49=\"\",\"\",BD49-AW52)","v":658},null,null,null,null,null,null,null,null,null,null,null,null,null,"円"]
[]
[null,null,null,null,null,null,"請　　　　　求　　　　　額",null,null,null,null,null,null,null,null,null,null,null,null,null,null,null,null,null,null,null,null,null,null,null,null,null,null,null,null,null,null,null,null,null,null,null,null,null,null,null,null,null,{"$f":"IF(BD49=\"\",\"\",ROUNDDOWN(BD49*(INDEX(10-データ記入,$CK$10,8)/10),0))","v":2630},null,null,null,null,null,null,null,null,null,null,null,null,null,"円"]
[null,null,null,null,null,null,null,null,null,null,null,null,null,null,null,null,null,null,null,null,null,null,null,null,null,null,null,null,null,null,null,null,null,null,null,null,null,null,null,null,null,null,null,null,null,null,null,null,null,null,null,null,null,null,null,null,null,null,null,null,null,null,null,null,null,null,null,null,null,null,null,null,null,null,null,null,null,null,null,null,null,null,null,null,null,null,null,null,null,null,null,null,null,null,null,"申請者名（被保険者）"]
[]
[null,null,null,null,null,null,null,null,null,null,null,null,null,{"$f":"AR1","v":10},null,"月",null,null,{"$f":"IF(INDEX(データ記入,$CK$10,52)=\"\",\"\",INDEX(データ記入,$CK$10,52))","v":""},null,{"$f":"IF(INDEX(データ記入,$CK$10,53)=\"\",\"\",INDEX(データ記入,$CK$10,53))","v":"○"},null,{"$f":"IF(INDEX(データ記入,$CK$10,54)=\"\",\"\",INDEX(データ記入,$CK$10,54))","v":""},null,{"$f":"IF(INDEX(データ記入,$CK$10,55)=\"\",\"\",INDEX(データ記入,$CK$10,55))","v":""},null,{"$f":"IF(INDEX(データ記入,$CK$10,56)=\"\",\"\",INDEX(データ記入,$CK$10,56))","v":""},null,{"$f":"IF(INDEX(データ記入,$CK$10,57)=\"\",\"\",INDEX(データ記入,$CK$10,57))","v":""},null,{"$f":"IF(INDEX(データ記入,$CK$10,58)=\"\",\"\",INDEX(データ記入,$CK$10,58))","v":"○"},null,{"$f":"IF(INDEX(データ記入,$CK$10,59)=\"\",\"\",INDEX(データ記入,$CK$10,59))","v":""},null,{"$f":"IF(INDEX(データ記入,$CK$10,60)=\"\",\"\",INDEX(データ記入,$CK$10,60))","v":""},null,{"$f":"IF(INDEX(データ記入,$CK$10,61)=\"\",\"\",INDEX(データ記入,$CK$10,61))","v":""},null,{"$f":"IF(INDEX(データ記入,$CK$10,62)=\"\",\"\",INDEX(データ記入,$CK$10,62))","v":""},null,{"$f":"IF(INDEX(データ記入,$CK$10,63)=\"\",\"\",INDEX(データ記入,$CK$10,63))","v":""},null,{"$f":"IF(INDEX(データ記入,$CK$10,64)=\"\",\"\",INDEX(データ記入,$CK$10,64))","v":""},null,{"$f":"IF(INDEX(データ記入,$CK$10,65)=\"\",\"\",INDEX(データ記入,$CK$10,65))","v":""},null,{"$f":"IF(INDEX(データ記入,$CK$10,66)=\"\",\"\",INDEX(データ記入,$CK$10,66))","v":""},null,{"$f":"IF(INDEX(データ記入,$CK$10,67)=\"\",\"\",INDEX(データ記入,$CK$10,67))","v":""},null,{"$f":"IF(INDEX(データ記入,$CK$10,68)=\"\",\"\",INDEX(データ記入,$CK$10,68))","v":""},null,{"$f":"IF(INDEX(データ記入,$CK$10,69)=\"\",\"\",INDEX(データ記入,$CK$10,69))","v":""},null,{"$f":"IF(INDEX(データ記入,$CK$10,70)=\"\",\"\",INDEX(データ記入,$CK$10,70))","v":""},null,{"$f":"IF(INDEX(データ記入,$CK$10,71)=\"\",\"\",INDEX(データ記入,$CK$10,71))","v":""},null,{"$f":"IF(INDEX(データ記入,$CK$10,72)=\"\",\"\",INDEX(データ記入,$CK$10,72))","v":""},null,{"$f":"IF(INDEX(データ記入,$CK$10,73)=\"\",\"\",INDEX(データ記入,$CK$10,73))","v":""},null,{"$f":"IF(INDEX(データ記入,$CK$10,74)=\"\",\"\",INDEX(データ記入,$CK$10,74))","v":""},null,{"$f":"IF(INDEX(データ記入,$CK$10,75)=\"\",\"\",INDEX(データ記入,$CK$10,75))","v":""},null,{"$f":"IF(INDEX(データ記入,$CK$10,76)=\"\",\"\",INDEX(データ記入,$CK$10,76))","v":""},null,{"$f":"IF(INDEX(データ記入,$CK$10,77)=\"\",\"\",INDEX(データ記入,$CK$10,77))","v":""},null,{"$f":"IF(INDEX(データ記入,$CK$10,78)=\"\",\"\",INDEX(データ記入,$CK$10,78))","v":""},null,{"$f":"IF(INDEX(データ記入,$CK$10,79)=\"\",\"\",INDEX(データ記入,$CK$10,79))","v":""},null,{"$f":"IF(INDEX(データ記入,$CK$10,80)=\"\",\"\",INDEX(データ記入,$CK$10,80))","v":""},null,{"$f":"IF(INDEX(データ記入,$CK$10,81)=\"\",\"\",INDEX(データ記入,$CK$10,81))","v":""},null,{"$f":"IF(INDEX(データ記入,$CK$10,82)=\"\",\"\",INDEX(データ記入,$CK$10,82))","v":""},null,null,null,null,null,null,null,null,null,null,null,null,null,null,null,null,{"$f":"IF(INDEX(データ記入,$CK$10,10)=\"\",\"\",INDEX(データ記入,$CK$10,10))","v":"後期花子"}]
[]
[null,"施術証明欄",null,null,null," 上記の通り施術を行い、その費用を領収しました。",null,null,null,null,null,null,null,null,null,null,null,null,null,null,null,null,null,null,null,null,null,null,null,null,null,null,null,null,null,null,null,null,null,null,null,null,"保健所登録区分"]
[]
[null,null,null,null,null,null,"療養費の受領を下記代理人に委任します。"]
[]
[null,null,null,null,null,null,null,null,{"$f":"AI1","v":"令和"},null,null,{"$f":"AM1","v":4},null,null,null,"年",null,{"$f":"AR1","v":10},null,null,null,"月",null,{"$f":"IF(INDEX(データ記入,$CK$10,251)=\"\",\"\",INDEX(データ記入,$CK$10,251))","v":7},null,null,null,"日",null,null,"施術所",null,null,null,null,null,null,null,"所在地",null,null,null,{"$f":"基本!C6","v":"福岡県福岡市博多駅2丁目12-3"}]
[]
[null,null,null,"    登録記号番号",null,null,null,null,null,null,null,null,null,null,null,null,null,null,null,null,null,null,null,null,null,null,null,null,null,null,null,null,null,null,null,null,null,null,"名　称",null,null,null,{"$f":"基本!I6","v":"福岡鍼灸院"}]
[null,null,null,{"$f":" 基本!C10","v":"40000141-0-0"},null,null,null,null,null,null,null,null,null,null,null,null,null,null,null,null,null,null,null,null,null,null,null,null,null,null,"施術管理者",null,null,null,null,null,null,null,"氏　名",null,null,null,{"$f":"基本!C5","v":"福岡太郎"},null,null,null,null,null,null,null,null,null,null,null,null,null,null,null,null,null,null,null,null,null,null,null,"電話",null,null,null,{"$f":"基本!C7","v":"092-123-4567"}]
[null,"申　請　欄"]
[null,null,null,null,null,"　上記の療養に要した費用に関して、療養費の支給を申請します。"]
[]
[null,null,null,null,null,null,null,null,{"$f":"AI1","v":"令和"},null,null,{"$f":"AM1","v":4},null,null,null,"年",null,{"$f":"AR1","v":10},null,null,null,"月",null,{"$f":"X61","v":7},null,null,null,"日",null,null,null,null,null,null,null,null,null,null,null,null,null,null,"〒",null,{"$f":"IF(INDEX(データ記入,$CK$10,14)=\"\",\"\",INDEX(データ記入,$CK$10,14))","v":"830-0027"}]
[null,null,null,null,null,null,null,null,null,null,null,null,null,null,null,null,null,null,null,null,null,null,null,null,null,null,null,null,null,null,null,null,null,null,null,"申請者",null,null,null,null,null,null,{"$f":"IF(INDEX(データ記入,$CK$10,15)=\"\",\"\",INDEX(データ記入,$CK$10,15))","v":"久留米市長門石3-11-35"}]
[]
[null,null,null,null,null,{"$f":"IF(INDEX(データ記入,$CK$10,48)=\"\",\"\",INDEX(データ記入,$CK$10,48)) &\"長 殿\"","v":"福岡県後期高齢者医療広域連合長 殿"},null,null,null,null,null,null,null,null,null,null,null,null,null,null,null,null,null,null,null,null,null,null,null,null,null,null,null,null,null,"（被保険者）",null,null,null,null,null,null,{"$f":"IF(INDEX(データ記入,$CK$10,10)=\"\",\"\",INDEX(データ記入,$CK$10,10))","v":"後期花子"},null,null,null,null,null,null,null,null,null,null,null,null,null,null,null,null,null,null,null,null,null,null,null,"電話",null,null,null,{"$f":"IF(INDEX(データ記入,$CK$10,50)=\"\",\"\",INDEX(データ記入,$CK$10,50))","v":"092-235-3402"},null,null,null,null,null,null,null,null,null,null,null,null,null,null,null,null,null,null,null,null,null,0.9]
[]
[null,"支払機関欄",null,null,null,null,"支払区分",null,null,null,null,null,null,null,null,null,null,null,null,null,null,null,null,null,null,null,null,null,null,null,"預金の種類",null,null,null,null,null,null,null,null,null,null,null,null,null,null,null,null,null,"金融機関名"]
[]
[null,null,null,null,null,null,"1．振　   込",null,null,null,null,null,null,null,null,null,null,"2．銀行送金",null,null,null,null,null,null,null,null,null,null,null,null,null,"1．普通",null,null,null,null,null,null,null,"3．当座",null,null,null,null,null,null,null,null,null,null,{"$f":"基本!C26&\"  \"&基本!C27","v":"福岡銀行  本店営業部"}]
[]
[null,null,null,null,null,null,"3．郵便局送金",null,null,null,null,null,null,null,null,null,null,"4．当 地 払",null,null,null,null,null,null,null,null,null,null,null,null,null,"2．通知",null,null,null,null,null,null,null,"4．別段"]
[]
[null,null,null,null,null,"口  座  名  義",null,null,null,null,null,null,null,null,null,{"$f":"基本!C29","v":"シャ）フクオカケンシンキュウマッサージシカイ"},null,null,null,null,null,null,null,null,null,null,null,null,null,null,null,null,null,null,null,null,null,null,null,"口座番号",null,null,null,null,null,null,null,{"$f":"記入!IX3","v":"6"},null,null,{"$f":"記入!IY3","v":"6"},null,null,{"$f":"記入!IZ3","v":"3"},null,null,{"$f":"記入!JA3","v":"7"},null,null,{"$f":"記入!JB3","v":"1"},null,null,{"$f":"記入!JC3","v":"1"},null,null,{"$f":"記入!JD3","v":"3"},null,null,{"$f":"\"郵便局\" & \" \"","v":"郵便局 "}]
[]
[null,null,null,null,null,"カタカナで記入"]
[]
[null,"同意記録",null,null,null,"同意医師の氏名",null,null,null,null,null,null,null,null,null,null,null,null,null,null,"住　　　　　所",null,null,null,null,null,null,null,null,null,null,null,null,null,null,null,null,null,null,null,null,null,"同　意　年　月　日",null,null,null,null,null,null,null,null,null,null,null,null,null,null,null,null,null,null,"傷　病　名",null,null,null,null,null,null,null,null,null,null,null,null,"要加療期間"]
[]
[null,null,null,null,null,null,null,{"$f":"IF(INDEX(データ記入,$CK$10,44)=\"\",\"\",INDEX(データ記入,$CK$10,44))","v":"伊藤和子"},null,null,null,null,null,null,null,null,null,null,null,null,{"$f":"IF(INDEX(データ記入,$CK$10,43)=\"\",\"\",INDEX(データ記入,$CK$10,43))","v":"福岡市中央区天神2-3-3"},null,null,null,null,null,null,null,null,null,null,null,null,null,null,null,null,null,null,null,null,null,null,null,null,null,null,null,null,null,null,null,null,null,null,null,null,null,null,null,null,{"$f":"IF(INDEX(データ記入,$CK$10,21)=\"\",\"\",INDEX(データ記入,$CK$10,21))","v":"腰痛症"}]
[null,null,null,null,null,null,null,null,null,null,null,null,null,null,null,null,null,null,null,null,null,null,null,null,null,null,null,null,null,null,null,null,null,null,null,null,null,null,null,null,null,null,null,{"$f":"IF(DC36=\"H\",\"平成\",\"令和\")","v":"令和"},null,null,{"$f":"IF(INDEX(データ記入,$CK$10,216)=\"\",\"\",INDEX(データ記入,$CK$10,216))","v":"04"},null,null,"年",null,{"$f":"IF(INDEX(データ記入,$CK$10,217)=\"\",\"\",INDEX(データ記入,$CK$10,217))","v":"05"},null,null,"月",null,{"$f":"IF(INDEX(データ記入,$CK$10,218)=\"\",\"\",INDEX(データ記入,$CK$10,218))","v":"02"},null,null,"日"]
[]
[]
[]
[null,null,"　本申請書に基づく給付金に関する受領を代理人に委任します。",null,null,null,null,null,null,null,null,null,null,null,null,null,null,null,null,null,null,null,null,null,null,null,null,null,null,null,null,null,null,null,null,null,null,null,null,null,null,null,null,null,null,null,null,null,null,null,{"$f":"AI1","v":"令和"},null,null,{"$f":"AM1","v":4},null,null,null,"年",null,{"$f":"AR1","v":10},null,null,null,"月",null,{"$f":"X61","v":7},null,null,null,"日"]
[]
[null,null,null,null,"申請者",null,null,null,null,null,null,null,null,"住所",null,null,null,null,null,{"$f":"AQ69","v":"久留米市長門石3-11-35"},null,null,null,null,null,null,null,null,null,null,null,null,null,null,null,null,null,null,null,null,"代理人",null,null,null,null,null,null,"住所",null,null,null,null,null,{"$f":"基本!C23","v":"福岡市博多区博多駅前4丁目5-12"}]
[null,null,null,null,null,null,null,null,null,null,null,null,null,null,null,null,null,null,null,null,null,null,null,null,null,null,null,null,null,null,null,null,null,null,null,null,null,null,null,null,null,null,null,null,null,null,null,null,null,null,null,null,null,{"$f":"基本!C24","v":"公益社団法人福岡県鍼灸マッサージ師会"}]
[null,null,null,null,"（被保険者）",null,null,null,null,null,null,null,null,"氏名",null,null,null,null,null,null,null,null,null,null,null,null,null,null,null,null,null,null,null,null,null,null,null,null,null,null,null,null,null,null,null,null,null,"氏名",null,null,null,null,null,{"$f":"基本!C25","v":"会長　古賀 慶之助"}]
[]
[]
[]
[]
[null,null,"※　この給付金の受療の代理人への委任は、受領委任の取扱規定（平成30年6月12日保発0612第2号通知）に従い行われるものです。"]
[null,null,"※　給付金に関する受領を代理人に委任する（申請者名義以外の口座に振込を希望される）場合に記入してください。"]
[null,null,"※　ただし、当該患者より依頼を受けた場合や当該患者が記入することができないやむを得ない理由がある場合は、"]
[null,null,null,null," 施術管理者等が代理をし当該患者から押印を受けてください。"]

{"sheet":"月16回以上施術","index":2,"n_rows":36,"n_cols":38,"rows_kept":36,"cut":false,"hidden":false,"merged":[[34,1,34,26],[35,1,35,26],[22,1,28,26],[29,1,29,26],[30,1,30,26],[31,1,31,26],[32,1,32,26],[33,1,33,26],[21,1,21,26],[11,16,11,17],[11,18,11,19],[11,20,11,21],[11,22,11,23],[11,24,11,25],[15,2,15,26],[16,3,17,26],[18,1,18,6],[18,7,18,26],[19,1,19,26],[20,2,20,26],[10,1,10,13],[10,14,10,16],[10,17,10,26],[11,1,17,1],[11,4,11,5],[11,6,11,7],[11,8,11,9],[11,10,11,11],[11,12,11,13],[11,14,11,15],[7,1,7,6],[7,7,7,26],[8,0,9,0],[8,1,8,6],[8,7,8,26],[9,1,9,6],[9,7,9,26],[1,1,2,20],[1,21,1,26],[2,21,2,26],[3,0,5,0],[3,1,4,6],[3,7,3,9],[3,10,3,26],[4,7,4,9],[4,10,4,26],[5,1,6,6],[5,7,5,26],[6,7,6,26]]}
[null,null,null,null,null,null,null,null,null,null,null,null,null,null,null,null,null,null,null,null,null,null,null,null,null,null,"別添１（別紙５）"]
[null,"１年以上・月１６回以上施術継続理由・状態記入書",null,null,null,null,null,null,null,null,null,null,null,null,null,null,null,null,null,null,null,"（はり・きゅう用）"]
[null,null,null,null,null,null,null,null,null,null,null,null,null,null,null,null,null,null,null,null,null,"（令和　　年　　月分）"]
["患　　　者","患者",null,null,null,null,null,"氏名"]
[null,null,null,null,null,null,null,"生年月日",null,null,"大 ・ 昭 ・ 平・ 令　　　年　　　月　　　日"]
[null,"傷病名",null,null,null,null,null,"１．神経痛　 ２．リウマチ 　３．頸腕症候群　 ４．五十肩"]
[null,null,null,null,null,null,null,"５．腰痛症　 ６．頸椎捻挫後遺症 　７．その他（　　　　 　　　　）"]
[null,"施術の種類",null,null,null,null,null,"１．はり　　　　２．きゅう　　　　３．はり・きゅう併用",null,null,null,null,null,null,null,null,null,null,null,null,null,null,null,null,null,null,null,null,null,null,null,null,null,null,null,"S","H","R"]
[null,"初療年月日",null,null,null,null,null,"昭 ・ 平　・ 令　　　年　　　月　　　日",null,null,null,null,null,null,null,null,null,null,null,null,null,null,null,null,null,null,null,null,null,null,null,null,null,null,null,{"$f":"IF(申請書!$DC$34=\"S\",\"○\",\"\")","v":""},{"$f":"IF(申請書!$DC$34=\"H\",\"○\",\"\")","v":""},{"$f":"IF(申請書!$DC$34=\"R\",\"○\",\"\")","v":"○"}]
[null,"施術回数",null,null,null,null,null,"月　　　　　回　　（当該月の施術回数を記載）"]
[null,"患者の状態の評価",null,null,null,null,null,null,null,null,null,null,null,null,"評価日",null,null,"令和　　　年　　　月　　　日"]
[null,"痛みの強さ",null,null,0,null,1,null,2,null,3,null,4,null,5,null,6,null,7,null,8,null,9,null,10]
[]
[]
[]
[null,null,"ＮＲＳ（Ｎumerical Ｒating Ｓcale：ﾆｭｰﾒﾘｶﾙ ﾚｰﾃｨﾝｸﾞ ｽｹｰﾙ）による評価"]
[null,null,null,"（注）全く痛みがない状態を「０」、自分が考え想像しうる最悪の痛みを「１０」として、\n      今感じている痛みの点数を患者に聞き、該当の点数に印をつけること。"]
[]
[null,"前月の評価の有無",null,null,null,null,null,"１．有り　　　　２．無し"]
[null,"前月の状態からの改善や変化（前月の評価の有無が「有り」の場合に記入）"]
[null,null,"１．悪化　　２．維持　　３．改善小　　４．改善中　　５．改善大"]
[null,"（症状、経過及び初療の日から１年以上経過して、月１６回以上の施術が必要な理由）"]
[]
[]
[]
[]
[]
[]
[]
[null,"　　上記のとおりであります。"]
[]
[null,"　　　　　　令和　　　年　　　月　　　日"]
[]
[null,"　　　　　　はり師・きゅう師氏名　　　　　　　　　　　　　　　　　　"]
[]
[null,"備考　　この用紙は、日本工業規格Ａ列４番とすること。"]

{"sheet":"基本","index":3,"n_rows":29,"n_cols":9,"rows_kept":29,"cut":false,"hidden":false,"merged":[[5,8,5,9],[6,2,6,5],[3,1,3,5],[5,2,5,5],[4,2,4,5],[7,2,7,4],[8,2,8,4],[9,2,9,4],[10,2,10,4],[27,2,27,5],[21,1,21,5],[16,1,16,3],[16,4,16,5],[17,1,17,3],[17,4,17,5],[28,2,28,5],[22,2,22,5],[23,2,23,5],[24,2,24,5],[25,2,25,5],[26,2,26,5],[12,8,18,12],[19,1,19,3],[19,4,19,5],[18,1,18,3],[18,4,18,5],[14,1,15,1],[14,2,14,3],[14,4,14,5],[15,2,15,3],[15,4,15,5],[12,1,13,1],[12,2,12,3],[12,4,12,5],[13,2,13,3],[13,4,13,5]]}
[]
[null,"基本データシート"]
[]
[null,"施術者データ",null,null,null,null,null,null,"　白ヌキのセルは自分で入力してください"]
[null,"施術者氏名","福岡太郎"]
[null,"施術者住所","福岡県福岡市博多駅2丁目12-3",null,null,null,null,"院名","福岡鍼灸院"]
[null,"施術者電話","092-123-4567"]
[null,"中央団体施術者登録番号","400010019577BU",null,null,{"$f":"LEN(C8)","v":14}]
[null,"福岡広域連合登録NO","4081600477",null,null,{"$f":"LEN(C9)","v":10}]
[null,"受領委任登録記号番号","40000141-0-0",null,null,{"$f":"LEN(C10)","v":12}]
[null,"機関コード"]
[]
[null,"初検料","１術",null,1780,null,null,null,"令和4年6月1日施術分より料金改定予定　初検料1術1,780円　初検料2術1,860円  1術1,550円  2術1,610円　電療料34円　往療料4ｋｍまで2,300円、4km超2700円。マッサージ1局所350円、温罨法125円、電気光線器具160円、徒手矯正術790円、往療料4km2,300円、4km超2,550円）　施術報告書交付料480円　"]
[null,null,"２術",null,1860]
[null,"施術料","１術",null,1550]
[null,null,"２術",null,1610]
[null,"電療加算",null,null,34]
[null,"　　往療　４ｋｍ　まで",null,null,2300]
[null,"　　往療　４ｋｍ　超",null,null,2550]
[null,"施術報告書交付料",null,null,480]
[]
[]
[null,"代理人住所","福岡市博多区博多駅前4丁目5-12"]
[null,"代理人（法人）","公益社団法人福岡県鍼灸マッサージ師会"]
[null,"代理人氏名","会長　古賀 慶之助"]
[null,"銀行名","福岡銀行"]
[null,"支店名","本店営業部"]
[null,"口座番号","6637113"]
[null,"口座名義人フリガナ","シャ）フクオカケンシンキュウマッサージシカイ"]

{"sheet":"カルテ","index":4,"n_rows":40,"n_cols":195,"rows_kept":40,"cut":false,"hidden":false,"merged":[[33,83,35,165],[39,84,54,163],[3,37,3,67],[3,99,3,123],[4,176,7,177],[6,2,6,24],[6,62,6,111],[6,132,6,148],[6,149,6,165],[8,119,9,126],[8,127,9,134],[8,135,9,142],[8,143,9,150],[8,151,9,158],[8,159,9,166],[8,2,11,15],[8,17,8,78],[8,79,11,87],[8,88,9,102],[8,103,9,110],[8,111,9,118],[9,17,11,78],[10,88,10,102],[10,103,10,166],[11,88,11,102],[11,103,11,129],[11,130,11,166],[12,2,12,15],[12,19,12,30],[12,33,12,40],[12,42,12,47],[12,49,12,56],[12,58,12,63],[12,65,12,72],[12,74,12,86],[12,88,12,102],[12,103,12,139],[12,140,12,161],[12,162,12,166],[13,2,16,15],[13,16,16,18],[13,19,13,25],[13,26,13,47],[13,88,13,102],[13,103,13,166],[14,19,16,87],[14,88,14,102],[14,103,14,166],[15,88,15,102],[15,103,15,166],[16,88,16,102],[16,103,16,114],[16,115,16,122],[16,123,16,127],[16,129,16,135],[16,138,16,142],[16,145,16,151],[16,154,16,158],[17,2,18,15],[17,19,18,87],[17,88,17,102],[17,103,17,114],[17,115,17,122],[17,123,17,127],[17,129,17,135],[17,138,17,142],[19,2,19,15],[19,16,19,19],[19,20,19,23],[19,24,19,27],[19,28,19,31],[19,32,19,35],[19,68,19,71],[19,72,19,75],[19,76,19,79],[19,80,19,83],[19,36,19,39],[19,40,19,43],[19,44,19,47],[19,48,19,51],[19,52,19,55],[19,56,19,59],[17,145,17,151],[17,154,17,158],[18,88,18,102],[18,103,18,114],[18,115,18,122],[18,123,18,127],[18,129,18,135],[18,138,18,142],[18,145,18,151],[18,154,18,158],[19,132,19,135],[19,136,19,139],[19,140,19,148],[19,149,19,166],[20,2,20,14],[20,16,20,19],[20,20,20,23],[20,24,20,27],[20,28,20,31],[20,32,20,35],[19,108,19,111],[19,112,19,115],[19,116,19,119],[19,120,19,123],[19,124,19,127],[19,128,19,131],[19,84,19,87],[19,88,19,91],[19,92,19,95],[19,96,19,99],[19,100,19,103],[19,104,19,107],[19,60,19,63],[19,64,19,67],[20,68,20,71],[20,72,20,75],[20,76,20,79],[20,80,20,83],[20,36,20,39],[20,40,20,43],[20,44,20,47],[20,48,20,51],[20,52,20,55],[20,56,20,59],[20,132,20,135],[20,136,20,139],[20,140,20,148],[20,149,20,166],[21,2,21,14],[21,16,21,19],[21,20,21,23],[21,24,21,27],[21,28,21,31],[21,32,21,35],[20,108,20,111],[20,112,20,115],[20,116,20,119],[20,120,20,123],[20,124,20,127],[20,128,20,131],[20,84,20,87],[20,88,20,91],[20,92,20,95],[20,96,20,99],[20,100,20,103],[20,104,20,107],[20,60,20,63],[20,64,20,67],[21,68,21,71],[21,72,21,75],[21,76,21,79],[21,80,21,83],[21,36,21,39],[21,40,21,43],[21,44,21,47],[21,48,21,51],[21,52,21,55],[21,56,21,59],[21,132,21,135],[21,136,21,139],[21,140,21,148],[21,149,21,166],[22,2,22,14],[22,16,22,19],[22,20,22,23],[22,24,22,27],[22,28,22,31],[22,32,22,35],[21,108,21,111],[21,112,21,115],[21,116,21,119],[21,120,21,123],[21,124,21,127],[21,128,21,131],[21,84,21,87],[21,88,21,91],[21,92,21,95],[21,96,21,99],[21,100,21,103],[21,104,21,107],[21,60,21,63],[21,64,21,67],[22,68,22,71],[22,72,22,75],[22,76,22,79],[22,80,22,83],[22,36,22,39],[22,40,22,43],[22,44,22,47],[22,48,22,51],[22,52,22,55],[22,56,22,59],[22,132,22,135],[22,136,22,139],[22,140,22,148],[22,149,22,166],[23,2,23,14],[23,16,23,19],[23,20,23,23],[23,24,23,27],[23,28,23,31],[23,32,23,35],[22,108,22,111],[22,112,22,115],[22,116,22,119],[22,120,22,123],[22,124,22,127],[22,128,22,131],[22,84,22,87],[22,88,22,91],[22,92,22,95],[22,96,22,99],[22,100,22,103],[22,104,22,107],[22,60,22,63],[22,64,22,67],[23,68,23,71],[23,72,23,75],[23,76,23,79],[23,80,23,83],[23,36,23,39],[23,40,23,43],[23,44,23,47],[23,48,23,51],[23,52,23,55],[23,56,23,59],[23,132,23,135],[23,136,23,139],[23,140,23,148],[23,149,23,166],[24,2,24,14],[24,16,24,19],[24,20,24,23],[24,24,24,27],[24,28,24,31],[24,32,24,35],[23,108,23,111],[23,112,23,115],[23,116,23,119],[23,120,23,123],[23,124,23,127],[23,128,23,131],[23,84,23,87],[23,88,23,91],[23,92,23,95],[23,96,23,99],[23,100,23,103],[23,104,23,107],[23,60,23,63],[23,64,23,67],[24,68,24,71],[24,72,24,75],[24,76,24,79],[24,80,24,83],[24,36,24,39],[24,40,24,43],[24,44,24,47],[24,48,24,51],[24,52,24,55],[24,56,24,59],[24,132,24,135],[24,136,24,139],[24,140,24,148],[24,149,24,166],[25,2,25,14],[25,16,25,19],[25,20,25,23],[25,24,25,27],[25,28,25,31],[25,32,25,35],[24,108,24,111],[24,112,24,115],[24,116,24,119],[24,120,24,123],[24,124,24,127],[24,128,24,131],[24,84,24,87],[24,88,24,91],[24,92,24,95],[24,96,24,99],[24,100,24,103],[24,104,24,107],[24,60,24,63],[24,64,24,67],[25,68,25,71],[25,72,25,75],[25,76,25,79],[25,80,25,83],[25,36,25,39],[25,40,25,43],[25,44,25,47],[25,48,25,51],[25,52,25,55],[25,56,25,59],[25,132,25,135],[25,136,25,139],[25,140,25,148],[25,149,25,166],[26,2,26,14],[26,16,26,19],[26,20,26,23],[26,24,26,27],[26,28,26,31],[26,32,26,35],[25,108,25,111],[25,112,25,115],[25,116,25,119],[25,120,25,123],[25,124,25,127],[25,128,25,131],[25,84,25,87],[25,88,25,91],[25,92,25,95],[25,96,25,99],[25,100,25,103],[25,104,25,107],[25,60,25,63],[25,64,25,67],[26,68,26,71],[26,72,26,75],[26,76,26,79],[26,80,26,83],[26,36,26,39],[26,40,26,43],[26,44,26,47],[26,48,26,51],[26,52,26,55],[26,56,26,59],[26,132,26,135],[26,136,26,139],[26,140,26,148],[26,149,26,166],[27,2,27,14],[27,16,27,19],[27,20,27,23],[27,24,27,27],[27,28,27,31],[27,32,27,35],[26,108,26,111],[26,112,26,115],[26,116,26,119],[26,120,26,123],[26,124,26,127],[26,128,26,131],[26,84,26,87],[26,88,26,91],[26,92,26,95],[26,96,26,99],[26,100,26,103],[26,104,26,107],[26,60,26,63],[26,64,26,67],[27,68,27,71],[27,72,27,75],[27,76,27,79],[27,80,27,83],[27,36,27,39],[27,40,27,43],[27,44,27,47],[27,48,27,51],[27,52,27,55],[27,56,27,59],[27,132,27,135],[27,136,27,139],[27,140,27,148],[27,149,27,166],[28,2,28,14],[28,16,28,19],[28,20,28,23],[28,24,28,27],[28,28,28,31],[28,32,28,35],[27,108,27,111],[27,112,27,115],[27,116,27,119],[27,120,27,123],[27,124,27,127],[27,128,27,131],[27,84,27,87],[27,88,27,91],[27,92,27,95],[27,96,27,99],[27,100,27,103],[27,104,27,107],[27,60,27,63],[27,64,27,67],[28,68,28,71],[28,72,28,75],[28,76,28,79],[28,80,28,83],[28,36,28,39],[28,40,28,43],[28,44,28,47],[28,48,28,51],[28,52,28,55],[28,56,28,59],[28,132,28,135],[28,136,28,139],[28,140,28,148],[28,149,28,166],[29,2,29,14],[29,16,29,19],[29,20,29,23],[29,24,29,27],[29,28,29,31],[29,32,29,35],[28,108,28,111],[28,112,28,115],[28,116,28,119],[28,120,28,123],[28,124,28,127],[28,128,28,131],[28,84,28,87],[28,88,28,91],[28,92,28,95],[28,96,28,99],[28,100,28,103],[28,104,28,107],[28,60,28,63],[28,64,28,67],[29,68,29,71],[29,72,29,75],[29,76,29,79],[29,80,29,83],[29,36,29,39],[29,40,29,43],[29,44,29,47],[29,48,29,51],[29,52,29,55],[29,56,29,59],[29,132,29,135],[29,136,29,139],[29,140,29,148],[29,149,29,166],[30,2,30,14],[30,16,30,19],[30,20,30,23],[30,24,30,27],[30,28,30,31],[30,32,30,35],[29,108,29,111],[29,112,29,115],[29,116,29,119],[29,120,29,123],[29,124,29,127],[29,128,29,131],[29,84,29,87],[29,88,29,91],[29,92,29,95],[29,96,29,99],[29,100,29,103],[29,104,29,107],[29,60,29,63],[29,64,29,67],[30,136,30,139],[30,140,30,148],[30,149,30,166],[31,2,31,14],[31,16,31,19],[31,20,31,23],[31,24,31,27],[31,28,31,31],[31,32,31,35],[30,108,30,111],[30,112,30,115],[30,116,30,119],[30,120,30,123],[30,124,30,127],[30,128,30,131],[30,84,30,87],[30,88,30,91],[30,92,30,95],[30,96,30,99],[30,100,30,103],[30,104,30,107],[30,60,30,63],[30,64,30,67],[30,68,30,71],[31,36,31,39],[31,40,31,43],[31,44,31,47],[31,48,31,51],[31,52,31,55],[31,56,31,59],[30,132,30,135],[30,72,30,75],[30,76,30,79],[30,80,30,83],[30,36,30,39],[30,40,30,43],[30,44,30,47],[30,48,30,51],[30,52,30,55],[30,56,30,59],[6,30,6,36],[31,84,31,87],[31,88,31,91],[31,92,31,95],[31,96,31,99],[31,100,31,103],[31,104,31,107],[56,133,56,166],[31,132,31,135],[31,136,31,139],[31,140,31,148],[31,149,31,166],[31,108,31,111],[31,112,31,115],[31,116,31,119],[31,120,31,123],[31,124,31,127],[31,128,31,131],[31,60,31,63],[31,64,31,67],[31,68,31,71],[31,72,31,75],[31,76,31,79],[31,80,31,83]]}
[]
[]
[]
[]
[null,null,null,null,null,null,null,null,null,null,null,null,null,null,null,null,null,null,null,null,null,null,null,null,null,null,null,null,null,null,null,null,null,null,null,null,null,null,null,null,null,null,null,null,null,null,null,null,null,null,null,null,null,null,null,null,null,null,null,null,null,null,null,null,null,null,null,null,null,null,null,null,null,null,null,null,null,null,null,null,null,null,null,null,null,null,null,null,null,null,null,null,null,null,null,null,null,null,null,null,null,null,null,null,null,null,null,null,null,null,null,null,null,null,null,null,null,null,null,null,null,null,null,null,null,null,null,null,null,null,null,null,null,null,null,null,null,null,null,null,null,null,null,null,null,null,null,null,null,null,null,null,null,null,null,null,null,null,null,null,null,null,null,null,null,null,null,null,null,null,null,null,null,null,null,null,1]
[]
[null,null,{"$f":"IF(INDEX(データ記入,$FU$5,4)=\"\",\"\",INDEX(データ記入,$FU$5,4))","v":"協会けんぽ"},null,null,null,null,null,null,null,null,null,null,null,null,null,null,null,null,null,null,null,null,null,null,null,null,null,null,null,{"$f":"IF(INDEX(データ記入,$FU$5,5)=\"\",\"\",INDEX(データ記入,$FU$5,5))","v":"本"},null,null,null,null,null,null,null,null,null,null,null,null,null,null,null,null,null,null,null,null,null,null,null,null,null,null,null,null,null,null,null,"社 保 カ ル テ",null,null,null,null,null,null,null,null,null,null,null,null,null,null,null,null,null,null,null,null,null,null,null,null,null,null,null,null,null,null,null,null,null,null,null,null,null,null,null,null,null,null,null,null,null,null,null,null,null,null,null,null,null,null,null,null,null,null,null,null,null,null,null,null,null,null,null,null,null," no.",null,null,null,null,null,null,null,null,null,null,null,null,null,null,null,null,{"$f":"FU5","v":1},null,null,null,null,null,null,null,null,null,null,null,null,null,null,null,null,null,null,null,null,null,null,null,null,null,null,null,null,null,null,null,null,null,null,null,null,null,null,null,null,null,null,null,null,3]
[]
[null,null,"氏　名 ",null,null,null,null,null,null,null,null,null,null,null,null,null,null,{"$f":"IF(AE7=\"本\",INDEX(データ記入,$FU$5,18),IF(INDEX(データ記入,$FU$5,18)=\"\",\"\",INDEX(データ記入,$FU$5,18)))","v":"キョウカイタロウ"},null,null,null,null,null,null,null,null,null,null,null,null,null,null,null,null,null,null,null,null,null,null,null,null,null,null,null,null,null,null,null,null,null,null,null,null,null,null,null,null,null,null,null,null,null,null,null,null,null,null,null,null,null,null,null,null,null,null,null,null,null,{"$f":"IF(AE7=\"本\",INDEX(データ記入,$FU$5,46),IF(INDEX(データ記入,$FU$5,47)=\"\",\"\",INDEX(データ記入,$FU$5,47)))","v":"男"},null,null,null,null,null,null,null,null,"保険者\n番　 号",null,null,null,null,null,null,null,null,null,null,null,null,null,null,{"$f":"IF(INDEX(データ記入,$FU$5,275)=\"\",\"\",INDEX(データ記入,$FU$5,275))","v":""},null,null,null,null,null,null,null,{"$f":"IF(INDEX(データ記入,$FU$5,276)=\"\",\"\",INDEX(データ記入,$FU$5,276))","v":""},null,null,null,null,null,null,null,{"$f":"IF(INDEX(データ記入,$FU$5,277)=\"\",\"\",INDEX(データ記入,$FU$5,277))","v":"4"},null,null,null,null,null,null,null,{"$f":"IF(INDEX(データ記入,$FU$5,278)=\"\",\"\",INDEX(データ記入,$FU$5,278))","v":"0"},null,null,null,null,null,null,null,{"$f":"IF(INDEX(データ記入,$FU$5,279)=\"\",\"\",INDEX(データ記入,$FU$5,279))","v":"0"},null,null,null,null,null,null,null,{"$f":"IF(INDEX(データ記入,$FU$5,280)=\"\",\"\",INDEX(データ記入,$FU$5,280))","v":"0"},null,null,null,null,null,null,null,{"$f":"IF(INDEX(データ記入,$FU$5,281)=\"\",\"\",INDEX(データ記入,$FU$5,281))","v":"4"},null,null,null,null,null,null,null,{"$f":"IF(INDEX(データ記入,$FU$5,282)=\"\",\"\",INDEX(データ記入,$FU$5,282))","v":"4"}]
[null,null,null,null,null,null,null,null,null,null,null,null,null,null,null,null,null,{"$f":"IF(AE7=\"本\",INDEX(データ記入,$FU$5,10),IF(INDEX(データ記入,$FU$5,17)=\"\",\"\",INDEX(データ記入,$FU$5,17)))","v":"協会太郎"}]
[null,null,null,null,null,null,null,null,null,null,null,null,null,null,null,null,null,null,null,null,null,null,null,null,null,null,null,null,null,null,null,null,null,null,null,null,null,null,null,null,null,null,null,null,null,null,null,null,null,null,null,null,null,null,null,null,null,null,null,null,null,null,null,null,null,null,null,null,null,null,null,null,null,null,null,null,null,null,null,null,null,null,null,null,null,null,null,null,"保険者",null,null,null,null,null,null,null,null,null,null,null,null,null,null,{"$f":"IF(INDEX(データ記入,$FU$5,48)=\"\",\"\",INDEX(データ記入,$FU$5,48))","v":"全国健康保険協会福岡支部"}]
[null,null,null,null,null,null,null,null,null,null,null,null,null,null,null,null,null,null,null,null,null,null,null,null,null,null,null,null,null,null,null,null,null,null,null,null,null,null,null,null,null,null,null,null,null,null,null,null,null,null,null,null,null,null,null,null,null,null,null,null,null,null,null,null,null,null,null,null,null,null,null,null,null,null,null,null,null,null,null,null,null,null,null,null,null,null,null,null,"被保険者\n記号番号",null,null,null,null,null,null,null,null,null,null,null,null,null,null,{"$f":"IF(INDEX(データ記入,$FU$5,6)=\"\",\"\",INDEX(データ記入,$FU$5,6))","v":"98765432"},null,null,null,null,null,null,null,null,null,null,null,null,null,null,null,null,null,null,null,null,null,null,null,null,null,null,{"$f":"IF(INDEX(データ記入,$FU$5,7)=\"\",\"\",INDEX(データ記入,$FU$5,7)&INDEX(データ記入,$FU$5,11))","v":"12345678（枝番）01"}]
[null,null,"生　年",null,null,null,null,null,null,null,null,null,null,null,null,null,null,null,null,{"$f":"IF(AE7=\"本\",INDEX(データ記入,$FU$5,103),IF(INDEX(データ記入,$FU$5,103)=\"\",\"\",INDEX(データ記入,$FU$5,103)))","v":"S"},null,null,null,null,null,null,null,null,null,null,null,null,null,{"$f":"IF(AE7=\"本\",INDEX(データ記入,$FU$5,104),IF(INDEX(データ記入,$FU$5,104)=\"\",\"\",INDEX(データ記入,$FU$5,104)))","v":"50"},null,null,null,null,null,null,null,null,"年",null,null,null,null,null,null,{"$f":"IF(AE7=\"本\",INDEX(データ記入,$FU$5,105),IF(INDEX(データ記入,$FU$5,105)=\"\",\"\",INDEX(データ記入,$FU$5,105)))","v":"04"},null,null,null,null,null,null,null,null,"月",null,null,null,null,null,null,{"$f":"IF(AE7=\"本\",INDEX(データ記入,$FU$5,106),IF(INDEX(データ記入,$FU$5,106)=\"\",\"\",INDEX(データ記入,$FU$5,106)))","v":"16"},null,null,null,null,null,null,null,null,"日 生 ",null,null,null,null,null,null,null,null,null,null,null,null,null,"被保険者",null,null,null,null,null,null,null,null,null,null,null,null,null,null,{"$f":"IF(INDEX(データ記入,$FU$5,10)=\"\",\"\",INDEX(データ記入,$FU$5,10))","v":"協会太郎"},null,null,null,null,null,null,null,null,null,null,null,null,null,null,null,null,null,null,null,null,null,null,null,null,null,null,null,null,null,null,null,null,null,null,null,null,{"$f":"IF(INDEX(データ記入,$FU$5,9)=\"\",\"\",INDEX(データ記入,$FU$5,9))","v":"S50/04/16"},null,null,null,null,null,null,null,null,null,null,null,null,null,null,null,null,null,null,null,null,null,"生"]
[null,null,"住　所",null,null,null,null,null,null,null,null,null,null,null,null,null,null,null,null,"〒",null,null,null,null,null,null,{"$f":"IF(INDEX(データ記入,$FU$5,14)=\"\",\"\",INDEX(データ記入,$FU$5,14))","v":"812-0871"},null,null,null,null,null,null,null,null,null,null,null,null,null,null,null,null,null,null,null,null,null,null,null,null,null,null,null,null,null,null,null,null,null,null,null,null,null,null,null,null,null,null,null,null,null,null,null,null,null,null,null,null,null,null,null,null,null,null,null,null,null,"同意医",null,null,null,null,null,null,null,null,null,null,null,null,null,null,{"$f":"IF(INDEX(データ記入,$FU$5,44)=\"\",\"\",INDEX(データ記入,$FU$5,44))","v":"伊藤和子"},null,null,null,null,null,null,null,null,null,null,null,null,null,null,null,null,null,null,null,null,null,null,null,null,null,null,null,null,null,null,null,null,null,null,null,null,null,null,null,null,null,null,null,null,null,null,null,null,null,null,null,null,null,null,null,null,null,null,null,null,null,null,null,null,null,null,null,null,null,null,null,null,null,null,null,null,{"$f":"IF(INDEX(データ記入,$FU$5,215)=\"\",\"\",INDEX(データ記入,$FU$5,215))","v":"R"},"同意"]
[null,null,null,null,null,null,null,null,null,null,null,null,null,null,null,null,null,null,null,{"$f":"IF(INDEX(データ記入,$FU$5,15)=\"\",\"\",INDEX(データ記入,$FU$5,15))","v":"福岡市博多区東雲町2-3-3"},null,null,null,null,null,null,null,null,null,null,null,null,null,null,null,null,null,null,null,null,null,null,null,null,null,null,null,null,null,null,null,null,null,null,null,null,null,null,null,null,null,null,null,null,null,null,null,null,null,null,null,null,null,null,null,null,null,null,null,null,null,null,null,null,null,null,null,null,"住　所",null,null,null,null,null,null,null,null,null,null,null,null,null,null,{"$f":"IF(INDEX(データ記入,$FU$5,43)=\"\",\"\",INDEX(データ記入,$FU$5,43))","v":"福岡市中央区天神2-3-3"},null,null,null,null,null,null,null,null,null,null,null,null,null,null,null,null,null,null,null,null,null,null,null,null,null,null,null,null,null,null,null,null,null,null,null,null,null,null,null,null,null,null,null,null,null,null,null,null,null,null,null,null,null,null,null,null,null,null,null,null,null,null,null,null,null,null,null,null,null,null,null,null,null,null,null,null,{"$f":"IF(INDEX(データ記入,$FU$5,144)=\"\",\"\",INDEX(データ記入,$FU$5,144))","v":"R"},"発病"]
[null,null,null,null,null,null,null,null,null,null,null,null,null,null,null,null,null,null,null,null,null,null,null,null,null,null,null,null,null,null,null,null,null,null,null,null,null,null,null,null,null,null,null,null,null,null,null,null,null,null,null,null,null,null,null,null,null,null,null,null,null,null,null,null,null,null,null,null,null,null,null,null,null,null,null,null,null,null,null,null,null,null,null,null,null,null,null,null,"傷病名",null,null,null,null,null,null,null,null,null,null,null,null,null,null,{"$f":"IF(INDEX(データ記入,$FU$5,21)=\"\",\"\",INDEX(データ記入,$FU$5,21))","v":"頚腕症候群"},null,null,null,null,null,null,null,null,null,null,null,null,null,null,null,null,null,null,null,null,null,null,null,null,null,null,null,null,null,null,null,null,null,null,null,null,null,null,null,null,null,null,null,null,null,null,null,null,null,null,null,null,null,null,null,null,null,null,null,null,null,null,null,null,null,null,null,null,null,null,null,null,null,null,null,null,{"$f":"IF(INDEX(データ記入,$FU$5,124)=\"\",\"\",INDEX(データ記入,$FU$5,124))","v":"R"},"初療"]
[null,null,null,null,null,null,null,null,null,null,null,null,null,null,null,null,null,null,null,null,null,null,null,null,null,null,null,null,null,null,null,null,null,null,null,null,null,null,null,null,null,null,null,null,null,null,null,null,null,null,null,null,null,null,null,null,null,null,null,null,null,null,null,null,null,null,null,null,null,null,null,null,null,null,null,null,null,null,null,null,null,null,null,null,null,null,null,null,"発　病",null,null,null,null,null,null,null,null,null,null,null,null,null,null,{"$f":"IF(FY15=\"H\",\"平成\",\"令和\")","v":"令和"},null,null,null,null,null,null,null,null,null,null,null,{"$f":"IF(INDEX(データ記入,$FU$5,141)=\"\",\"\",INDEX(データ記入,$FU$5,141))","v":"02"},null,null,null,null,null,null,null,"年",null,null,null,null,null,{"$f":"IF(INDEX(データ記入,$FU$5,142)=\"\",\"\",INDEX(データ記入,$FU$5,142))","v":"10"},null,null,null,null,null,null,null,null,"月",null,null,null,null,null,null,{"$f":"IF(INDEX(データ記入,$FU$5,143)=\"\",\"\",INDEX(データ記入,$FU$5,143))","v":"05"},null,null,null,null,null,null,null,null,"日"]
[null,null,"電　話",null,null,null,null,null,null,null,null,null,null,null,null,null,null,null,null,{"$f":"IF(INDEX(データ記入,$FU$5,50)=\"\",\"\",INDEX(データ記入,$FU$5,50))","v":"092-235-3402"},null,null,null,null,null,null,null,null,null,null,null,null,null,null,null,null,null,null,null,null,null,null,null,null,null,null,null,null,null,null,null,null,null,null,null,null,null,null,null,null,null,null,null,null,null,null,null,null,null,null,null,null,null,null,null,null,null,null,null,null,null,null,null,null,null,null,null,null,"同　意",null,null,null,null,null,null,null,null,null,null,null,null,null,null,{"$f":"IF(FY14=\"H\",\"平成\",\"令和\")","v":"令和"},null,null,null,null,null,null,null,null,null,null,null,{"$f":"IF(INDEX(データ記入,$FU$5,216)=\"\",\"\",INDEX(データ記入,$FU$5,216))","v":"04"},null,null,null,null,null,null,null,"年",null,null,null,null,null,{"$f":"IF(INDEX(データ記入,$FU$5,217)=\"\",\"\",INDEX(データ記入,$FU$5,217))","v":"05"},null,null,null,null,null,null,null,null,"月",null,null,null,null,null,null,{"$f":"IF(INDEX(データ記入,$FU$5,218)=\"\",\"\",INDEX(データ記入,$FU$5,218))","v":"01"},null,null,null,null,null,null,null,null,"日"]
[null,null,null,null,null,null,null,null,null,null,null,null,null,null,null,null,null,null,null,null,null,null,null,null,null,null,null,null,null,null,null,null,null,null,null,null,null,null,null,null,null,null,null,null,null,null,null,null,null,null,null,null,null,null,null,null,null,null,null,null,null,null,null,null,null,null,null,null,null,null,null,null,null,null,null,null,null,null,null,null,null,null,null,null,null,null,null,null,"初　療",null,null,null,null,null,null,null,null,null,null,null,null,null,null,{"$f":"IF(FY16=\"H\",\"平成\",\"令和\")","v":"令和"},null,null,null,null,null,null,null,null,null,null,null,{"$f":"IF(INDEX(データ記入,$FU$5,125)=\"\",\"\",INDEX(データ記入,$FU$5,125))","v":"02"},null,null,null,null,null,null,null,"年",null,null,null,null,null,{"$f":"IF(INDEX(データ記入,$FU$5,126)=\"\",\"\",INDEX(データ記入,$FU$5,126))","v":"04"},null,null,null,null,null,null,null,null,"月",null,null,null,null,null,null,{"$f":"IF(INDEX(データ記入,$FU$5,127)=\"\",\"\",INDEX(データ記入,$FU$5,127))","v":"30"},null,null,null,null,null,null,null,null,"日"]
[null,null,"施術月",null,null,null,null,null,null,null,null,null,null,null,null,null,1,null,null,null,2,null,null,null,3,null,null,null,4,null,null,null,5,null,null,null,6,null,null,null,7,null,null,null,8,null,null,null,9,null,null,null,10,null,null,null,11,null,null,null,12,null,null,null,13,null,null,null,14,null,null,null,15,null,null,null,16,null,null,null,17,null,null,null,18,null,null,null,19,null,null,null,20,null,null,null,21,null,null,null,22,null,null,null,23,null,null,null,24,null,null,null,25,null,null,null,26,null,null,null,27,null,null,null,28,null,null,null,29,null,null,null,30,null,null,null,31,null,null,null,"回数",null,null,null,null,null,null,null,null,"10割請求額"]
[null,1,"１月",null,null,null,null,null,null,null,null,null,null,null,null,null,{"$f":"IF(INDEX(データ記入,$FU$5,288)=\"\",\"\",INDEX(データ記入,$FU$5,288))","v":""},null,null,null,{"$f":"IF(INDEX(データ記入,$FU$5,289)=\"\",\"\",INDEX(データ記入,$FU$5,289))","v":""},null,null,null,{"$f":"IF(INDEX(データ記入,$FU$5,290)=\"\",\"\",INDEX(データ記入,$FU$5,290))","v":""},null,null,null,{"$f":"IF(INDEX(データ記入,$FU$5,291)=\"\",\"\",INDEX(データ記入,$FU$5,291))","v":""},null,null,null,{"$f":"IF(INDEX(データ記入,$FU$5,292)=\"\",\"\",INDEX(データ記入,$FU$5,292))","v":""},null,null,null,{"$f":"IF(INDEX(データ記入,$FU$5,293)=\"\",\"\",INDEX(データ記入,$FU$5,293))","v":""},null,null,null,{"$f":"IF(INDEX(データ記入,$FU$5,294)=\"\",\"\",INDEX(データ記入,$FU$5,294))","v":""},null,null,null,{"$f":"IF(INDEX(データ記入,$FU$5,295)=\"\",\"\",INDEX(データ記入,$FU$5,295))","v":""},null,null,null,{"$f":"IF(INDEX(データ記入,$FU$5,296)=\"\",\"\",INDEX(データ記入,$FU$5,296))","v":""},null,null,null,{"$f":"IF(INDEX(データ記入,$FU$5,297)=\"\",\"\",INDEX(データ記入,$FU$5,297))","v":""},null,null,null,{"$f":"IF(INDEX(データ記入,$FU$5,298)=\"\",\"\",INDEX(データ記入,$FU$5,298))","v":""},null,null,null,{"$f":"IF(INDEX(データ記入,$FU$5,299)=\"\",\"\",INDEX(データ記入,$FU$5,299))","v":""},null,null,null,{"$f":"IF(INDEX(データ記入,$FU$5,300)=\"\",\"\",INDEX(データ記入,$FU$5,300))","v":""},null,null,null,{"$f":"IF(INDEX(データ記入,$FU$5,301)=\"\",\"\",INDEX(データ記入,$FU$5,301))","v":""},null,null,null,{"$f":"IF(INDEX(データ記入,$FU$5,302)=\"\",\"\",INDEX(データ記入,$FU$5,302))","v":""},null,null,null,{"$f":"IF(INDEX(データ記入,$FU$5,303)=\"\",\"\",INDEX(データ記入,$FU$5,303))","v":""},null,null,null,{"$f":"IF(INDEX(データ記入,$FU$5,304)=\"\",\"\",INDEX(データ記入,$FU$5,304))","v":""},null,null,null,{"$f":"IF(INDEX(データ記入,$FU$5,305)=\"\",\"\",INDEX(データ記入,$FU$5,305))","v":""},null,null,null,{"$f":"IF(INDEX(データ記入,$FU$5,306)=\"\",\"\",INDEX(データ記入,$FU$5,306))","v":""},null,null,null,{"$f":"IF(INDEX(データ記入,$FU$5,307)=\"\",\"\",INDEX(データ記入,$FU$5,307))","v":""},null,null,null,{"$f":"IF(INDEX(データ記入,$FU$5,308)=\"\",\"\",INDEX(データ記入,$FU$5,308))","v":""},null,null,null,{"$f":"IF(INDEX(データ記入,$FU$5,309)=\"\",\"\",INDEX(データ記入,$FU$5,309))","v":""},null,null,null,{"$f":"IF(INDEX(データ記入,$FU$5,310)=\"\",\"\",INDEX(データ記入,$FU$5,310))","v":""},null,null,null,{"$f":"IF(INDEX(データ記入,$FU$5,311)=\"\",\"\",INDEX(データ記入,$FU$5,311))","v":""},null,null,null,{"$f":"IF(INDEX(データ記入,$FU$5,312)=\"\",\"\",INDEX(データ記入,$FU$5,312))","v":""},null,null,null,{"$f":"IF(INDEX(データ記入,$FU$5,313)=\"\",\"\",INDEX(データ記入,$FU$5,313))","v":""},null,null,null,{"$f":"IF(INDEX(データ記入,$FU$5,314)=\"\",\"\",INDEX(データ記入,$FU$5,314))","v":""},null,null,null,{"$f":"IF(INDEX(データ記入,$FU$5,315)=\"\",\"\",INDEX(データ記入,$FU$5,315))","v":""},null,null,null,{"$f":"IF(INDEX(データ記入,$FU$5,316)=\"\",\"\",INDEX(データ記入,$FU$5,316))","v":""},null,null,null,{"$f":"IF(INDEX(データ記入,$FU$5,317)=\"\",\"\",INDEX(データ記入,$FU$5,317))","v":""},null,null,null,{"$f":"IF(INDEX(データ記入,$FU$5,318)=\"\",\"\",INDEX(データ記入,$FU$5,318))","v":""},null,null,null,{"$f":"IF(INDEX(データ記入,$FU$5,286)=\"\",\"\",INDEX(データ記入,$FU$5,286))","v":""},null,null,null,null,null,null,null,null,{"$f":"IF(INDEX(データ記入,$FU$5,287)=\"\",\"\",INDEX(データ記入,$FU$5,287))","v":""}]
[null,2,"２月",null,null,null,null,null,null,null,null,null,null,null,null,null,{"$f":"IF(INDEX(データ記入,$FU$5,321)=\"\",\"\",INDEX(データ記入,$FU$5,321))","v":""},null,null,null,{"$f":"IF(INDEX(データ記入,$FU$5,322)=\"\",\"\",INDEX(データ記入,$FU$5,322))","v":""},null,null,null,{"$f":"IF(INDEX(データ記入,$FU$5,323)=\"\",\"\",INDEX(データ記入,$FU$5,323))","v":""},null,null,null,{"$f":"IF(INDEX(データ記入,$FU$5,324)=\"\",\"\",INDEX(データ記入,$FU$5,324))","v":""},null,null,null,{"$f":"IF(INDEX(データ記入,$FU$5,325)=\"\",\"\",INDEX(データ記入,$FU$5,325))","v":""},null,null,null,{"$f":"IF(INDEX(データ記入,$FU$5,326)=\"\",\"\",INDEX(データ記入,$FU$5,326))","v":""},null,null,null,{"$f":"IF(INDEX(データ記入,$FU$5,327)=\"\",\"\",INDEX(データ記入,$FU$5,327))","v":""},null,null,null,{"$f":"IF(INDEX(データ記入,$FU$5,328)=\"\",\"\",INDEX(データ記入,$FU$5,328))","v":""},null,null,null,{"$f":"IF(INDEX(データ記入,$FU$5,329)=\"\",\"\",INDEX(データ記入,$FU$5,329))","v":""},null,null,null,{"$f":"IF(INDEX(データ記入,$FU$5,330)=\"\",\"\",INDEX(データ記入,$FU$5,330))","v":""},null,null,null,{"$f":"IF(INDEX(データ記入,$FU$5,331)=\"\",\"\",INDEX(データ記入,$FU$5,331))","v":""},null,null,null,{"$f":"IF(INDEX(データ記入,$FU$5,332)=\"\",\"\",INDEX(データ記入,$FU$5,332))","v":""},null,null,null,{"$f":"IF(INDEX(データ記入,$FU$5,333)=\"\",\"\",INDEX(データ記入,$FU$5,333))","v":""},null,null,null,{"$f":"IF(INDEX(データ記入,$FU$5,334)=\"\",\"\",INDEX(データ記入,$FU$5,334))","v":""},null,null,null,{"$f":"IF(INDEX(データ記入,$FU$5,335)=\"\",\"\",INDEX(データ記入,$FU$5,335))","v":""},null,null,null,{"$f":"IF(INDEX(データ記入,$FU$5,336)=\"\",\"\",INDEX(データ記入,$FU$5,336))","v":""},null,null,null,{"$f":"IF(INDEX(データ記入,$FU$5,337)=\"\",\"\",INDEX(データ記入,$FU$5,337))","v":""},null,null,null,{"$f":"IF(INDEX(データ記入,$FU$5,338)=\"\",\"\",INDEX(データ記入,$FU$5,338))","v":""},null,null,null,{"$f":"IF(INDEX(データ記入,$FU$5,339)=\"\",\"\",INDEX(データ記入,$FU$5,339))","v":""},null,null,null,{"$f":"IF(INDEX(データ記入,$FU$5,340)=\"\",\"\",INDEX(データ記入,$FU$5,340))","v":""},null,null,null,{"$f":"IF(INDEX(データ記入,$FU$5,341)=\"\",\"\",INDEX(データ記入,$FU$5,341))","v":""},null,null,null,{"$f":"IF(INDEX(データ記入,$FU$5,342)=\"\",\"\",INDEX(データ記入,$FU$5,342))","v":""},null,null,null,{"$f":"IF(INDEX(データ記入,$FU$5,343)=\"\",\"\",INDEX(データ記入,$FU$5,343))","v":""},null,null,null,{"$f":"IF(INDEX(データ記入,$FU$5,344)=\"\",\"\",INDEX(データ記入,$FU$5,344))","v":""},null,null,null,{"$f":"IF(INDEX(データ記入,$FU$5,345)=\"\",\"\",INDEX(データ記入,$FU$5,345))","v":""},null,null,null,{"$f":"IF(INDEX(データ記入,$FU$5,346)=\"\",\"\",INDEX(データ記入,$FU$5,346))","v":""},null,null,null,{"$f":"IF(INDEX(データ記入,$FU$5,347)=\"\",\"\",INDEX(データ記入,$FU$5,347))","v":""},null,null,null,{"$f":"IF(INDEX(データ記入,$FU$5,348)=\"\",\"\",INDEX(データ記入,$FU$5,348))","v":""},null,null,null,{"$f":"IF(INDEX(データ記入,$FU$5,349)=\"\",\"\",INDEX(データ記入,$FU$5,349))","v":""},null,null,null,{"$f":"IF(INDEX(データ記入,$FU$5,350)=\"\",\"\",INDEX(データ記入,$FU$5,350))","v":""},null,null,null,{"$f":"IF(INDEX(データ記入,$FU$5,351)=\"\",\"\",INDEX(データ記入,$FU$5,351))","v":""},null,null,null,{"$f":"IF(INDEX(データ記入,$FU$5,319)=\"\",\"\",INDEX(データ記入,$FU$5,319))","v":""},null,null,null,null,null,null,null,null,{"$f":"IF(INDEX(データ記入,$FU$5,320)=\"\",\"\",INDEX(データ記入,$FU$5,320))","v":""}]
[null,3,"３月",null,null,null,null,null,null,null,null,null,null,null,null,null,{"$f":"IF(INDEX(データ記入,$FU$5,354)=\"\",\"\",INDEX(データ記入,$FU$5,354))","v":""},null,null,null,{"$f":"IF(INDEX(データ記入,$FU$5,355)=\"\",\"\",INDEX(データ記入,$FU$5,355))","v":""},null,null,null,{"$f":"IF(INDEX(データ記入,$FU$5,356)=\"\",\"\",INDEX(データ記入,$FU$5,356))","v":""},null,null,null,{"$f":"IF(INDEX(データ記入,$FU$5,357)=\"\",\"\",INDEX(データ記入,$FU$5,357))","v":""},null,null,null,{"$f":"IF(INDEX(データ記入,$FU$5,358)=\"\",\"\",INDEX(データ記入,$FU$5,358))","v":""},null,null,null,{"$f":"IF(INDEX(データ記入,$FU$5,359)=\"\",\"\",INDEX(データ記入,$FU$5,359))","v":""},null,null,null,{"$f":"IF(INDEX(データ記入,$FU$5,360)=\"\",\"\",INDEX(データ記入,$FU$5,360))","v":""},null,null,null,{"$f":"IF(INDEX(データ記入,$FU$5,361)=\"\",\"\",INDEX(データ記入,$FU$5,361))","v":""},null,null,null,{"$f":"IF(INDEX(データ記入,$FU$5,362)=\"\",\"\",INDEX(データ記入,$FU$5,362))","v":""},null,null,null,{"$f":"IF(INDEX(データ記入,$FU$5,363)=\"\",\"\",INDEX(データ記入,$FU$5,363))","v":""},null,null,null,{"$f":"IF(INDEX(データ記入,$FU$5,364)=\"\",\"\",INDEX(データ記入,$FU$5,364))","v":""},null,null,null,{"$f":"IF(INDEX(データ記入,$FU$5,365)=\"\",\"\",INDEX(データ記入,$FU$5,365))","v":""},null,null,null,{"$f":"IF(INDEX(データ記入,$FU$5,366)=\"\",\"\",INDEX(データ記入,$FU$5,366))","v":""},null,null,null,{"$f":"IF(INDEX(データ記入,$FU$5,367)=\"\",\"\",INDEX(データ記入,$FU$5,367))","v":""},null,null,null,{"$f":"IF(INDEX(データ記入,$FU$5,368)=\"\",\"\",INDEX(データ記入,$FU$5,368))","v":""},null,null,null,{"$f":"IF(INDEX(データ記入,$FU$5,369)=\"\",\"\",INDEX(データ記入,$FU$5,369))","v":""},null,null,null,{"$f":"IF(INDEX(データ記入,$FU$5,370)=\"\",\"\",INDEX(データ記入,$FU$5,370))","v":""},null,null,null,{"$f":"IF(INDEX(データ記入,$FU$5,371)=\"\",\"\",INDEX(データ記入,$FU$5,371))","v":""},null,null,null,{"$f":"IF(INDEX(データ記入,$FU$5,372)=\"\",\"\",INDEX(データ記入,$FU$5,372))","v":""},null,null,null,{"$f":"IF(INDEX(データ記入,$FU$5,373)=\"\",\"\",INDEX(データ記入,$FU$5,373))","v":""},null,null,null,{"$f":"IF(INDEX(データ記入,$FU$5,374)=\"\",\"\",INDEX(データ記入,$FU$5,374))","v":""},null,null,null,{"$f":"IF(INDEX(データ記入,$FU$5,375)=\"\",\"\",INDEX(データ記入,$FU$5,375))","v":""},null,null,null,{"$f":"IF(INDEX(データ記入,$FU$5,376)=\"\",\"\",INDEX(データ記入,$FU$5,376))","v":""},null,null,null,{"$f":"IF(INDEX(データ記入,$FU$5,377)=\"\",\"\",INDEX(データ記入,$FU$5,377))","v":""},null,null,null,{"$f":"IF(INDEX(データ記入,$FU$5,378)=\"\",\"\",INDEX(データ記入,$FU$5,378))","v":""},null,null,null,{"$f":"IF(INDEX(データ記入,$FU$5,379)=\"\",\"\",INDEX(データ記入,$FU$5,379))","v":""},null,null,null,{"$f":"IF(INDEX(データ記入,$FU$5,380)=\"\",\"\",INDEX(データ記入,$FU$5,380))","v":""},null,null,null,{"$f":"IF(INDEX(データ記入,$FU$5,381)=\"\",\"\",INDEX(データ記入,$FU$5,381))","v":""},null,null,null,{"$f":"IF(INDEX(データ記入,$FU$5,382)=\"\",\"\",INDEX(データ記入,$FU$5,382))","v":""},null,null,null,{"$f":"IF(INDEX(データ記入,$FU$5,383)=\"\",\"\",INDEX(データ記入,$FU$5,383))","v":""},null,null,null,{"$f":"IF(INDEX(データ記入,$FU$5,384)=\"\",\"\",INDEX(データ記入,$FU$5,384))","v":""},null,null,null,{"$f":"IF(INDEX(データ記入,$FU$5,352)=\"\",\"\",INDEX(データ記入,$FU$5,352))","v":""},null,null,null,null,null,null,null,null,{"$f":"IF(INDEX(データ記入,$FU$5,353)=\"\",\"\",INDEX(データ記入,$FU$5,353))","v":""}]
[null,4,"４月",null,null,null,null,null,null,null,null,null,null,null,null,null,{"$f":"IF(INDEX(データ記入,$FU$5,387)=\"\",\"\",INDEX(データ記入,$FU$5,387))","v":""},null,null,null,{"$f":"IF(INDEX(データ記入,$FU$5,388)=\"\",\"\",INDEX(データ記入,$FU$5,388))","v":""},null,null,null,{"$f":"IF(INDEX(データ記入,$FU$5,389)=\"\",\"\",INDEX(データ記入,$FU$5,389))","v":""},null,null,null,{"$f":"IF(INDEX(データ記入,$FU$5,390)=\"\",\"\",INDEX(データ記入,$FU$5,390))","v":""},null,null,null,{"$f":"IF(INDEX(データ記入,$FU$5,391)=\"\",\"\",INDEX(データ記入,$FU$5,391))","v":""},null,null,null,{"$f":"IF(INDEX(データ記入,$FU$5,392)=\"\",\"\",INDEX(データ記入,$FU$5,392))","v":""},null,null,null,{"$f":"IF(INDEX(データ記入,$FU$5,393)=\"\",\"\",INDEX(データ記入,$FU$5,393))","v":""},null,null,null,{"$f":"IF(INDEX(データ記入,$FU$5,394)=\"\",\"\",INDEX(データ記入,$FU$5,394))","v":""},null,null,null,{"$f":"IF(INDEX(データ記入,$FU$5,395)=\"\",\"\",INDEX(データ記入,$FU$5,395))","v":""},null,null,null,{"$f":"IF(INDEX(データ記入,$FU$5,396)=\"\",\"\",INDEX(データ記入,$FU$5,396))","v":""},null,null,null,{"$f":"IF(INDEX(データ記入,$FU$5,397)=\"\",\"\",INDEX(データ記入,$FU$5,397))","v":""},null,null,null,{"$f":"IF(INDEX(データ記入,$FU$5,398)=\"\",\"\",INDEX(データ記入,$FU$5,398))","v":""},null,null,null,{"$f":"IF(INDEX(データ記入,$FU$5,399)=\"\",\"\",INDEX(データ記入,$FU$5,399))","v":""},null,null,null,{"$f":"IF(INDEX(データ記入,$FU$5,400)=\"\",\"\",INDEX(データ記入,$FU$5,400))","v":""},null,null,null,{"$f":"IF(INDEX(データ記入,$FU$5,401)=\"\",\"\",INDEX(データ記入,$FU$5,401))","v":""},null,null,null,{"$f":"IF(INDEX(データ記入,$FU$5,402)=\"\",\"\",INDEX(データ記入,$FU$5,402))","v":""},null,null,null,{"$f":"IF(INDEX(データ記入,$FU$5,403)=\"\",\"\",INDEX(データ記入,$FU$5,403))","v":""},null,null,null,{"$f":"IF(INDEX(データ記入,$FU$5,404)=\"\",\"\",INDEX(データ記入,$FU$5,404))","v":""},null,null,null,{"$f":"IF(INDEX(データ記入,$FU$5,405)=\"\",\"\",INDEX(データ記入,$FU$5,405))","v":""},null,null,null,{"$f":"IF(INDEX(データ記入,$FU$5,406)=\"\",\"\",INDEX(データ記入,$FU$5,406))","v":""},null,null,null,{"$f":"IF(INDEX(データ記入,$FU$5,407)=\"\",\"\",INDEX(データ記入,$FU$5,407))","v":""},null,null,null,{"$f":"IF(INDEX(データ記入,$FU$5,408)=\"\",\"\",INDEX(データ記入,$FU$5,408))","v":""},null,null,null,{"$f":"IF(INDEX(データ記入,$FU$5,409)=\"\",\"\",INDEX(データ記入,$FU$5,409))","v":""},null,null,null,{"$f":"IF(INDEX(データ記入,$FU$5,410)=\"\",\"\",INDEX(データ記入,$FU$5,410))","v":""},null,null,null,{"$f":"IF(INDEX(データ記入,$FU$5,411)=\"\",\"\",INDEX(データ記入,$FU$5,411))","v":""},null,null,null,{"$f":"IF(INDEX(データ記入,$FU$5,412)=\"\",\"\",INDEX(データ記入,$FU$5,412))","v":""},null,null,null,{"$f":"IF(INDEX(データ記入,$FU$5,413)=\"\",\"\",INDEX(データ記入,$FU$5,413))","v":""},null,null,null,{"$f":"IF(INDEX(データ記入,$FU$5,414)=\"\",\"\",INDEX(データ記入,$FU$5,414))","v":""},null,null,null,{"$f":"IF(INDEX(データ記入,$FU$5,415)=\"\",\"\",INDEX(データ記入,$FU$5,415))","v":""},null,null,null,{"$f":"IF(INDEX(データ記入,$FU$5,416)=\"\",\"\",INDEX(データ記入,$FU$5,416))","v":""},null,null,null,{"$f":"IF(INDEX(データ記入,$FU$5,417)=\"\",\"\",INDEX(データ記入,$FU$5,417))","v":""},null,null,null,{"$f":"IF(INDEX(データ記入,$FU$5,385)=\"\",\"\",INDEX(データ記入,$FU$5,385))","v":""},null,null,null,null,null,null,null,null,{"$f":"IF(INDEX(データ記入,$FU$5,386)=\"\",\"\",INDEX(データ記入,$FU$5,386))","v":""}]
[null,5,"５月",null,null,null,null,null,null,null,null,null,null,null,null,null,{"$f":"IF(INDEX(データ記入,$FU$5,420)=\"\",\"\",INDEX(データ記入,$FU$5,420))","v":""},null,null,null,{"$f":"IF(INDEX(データ記入,$FU$5,421)=\"\",\"\",INDEX(データ記入,$FU$5,421))","v":""},null,null,null,{"$f":"IF(INDEX(データ記入,$FU$5,422)=\"\",\"\",INDEX(データ記入,$FU$5,422))","v":""},null,null,null,{"$f":"IF(INDEX(データ記入,$FU$5,423)=\"\",\"\",INDEX(データ記入,$FU$5,423))","v":""},null,null,null,{"$f":"IF(INDEX(データ記入,$FU$5,424)=\"\",\"\",INDEX(データ記入,$FU$5,424))","v":""},null,null,null,{"$f":"IF(INDEX(データ記入,$FU$5,425)=\"\",\"\",INDEX(データ記入,$FU$5,425))","v":""},null,null,null,{"$f":"IF(INDEX(データ記入,$FU$5,426)=\"\",\"\",INDEX(データ記入,$FU$5,426))","v":""},null,null,null,{"$f":"IF(INDEX(データ記入,$FU$5,427)=\"\",\"\",INDEX(データ記入,$FU$5,427))","v":""},null,null,null,{"$f":"IF(INDEX(データ記入,$FU$5,428)=\"\",\"\",INDEX(データ記入,$FU$5,428))","v":""},null,null,null,{"$f":"IF(INDEX(データ記入,$FU$5,429)=\"\",\"\",INDEX(データ記入,$FU$5,429))","v":"○"},null,null,null,{"$f":"IF(INDEX(データ記入,$FU$5,430)=\"\",\"\",INDEX(データ記入,$FU$5,430))","v":""},null,null,null,{"$f":"IF(INDEX(データ記入,$FU$5,431)=\"\",\"\",INDEX(データ記入,$FU$5,431))","v":""},null,null,null,{"$f":"IF(INDEX(データ記入,$FU$5,432)=\"\",\"\",INDEX(データ記入,$FU$5,432))","v":""},null,null,null,{"$f":"IF(INDEX(データ記入,$FU$5,433)=\"\",\"\",INDEX(データ記入,$FU$5,433))","v":""},null,null,null,{"$f":"IF(INDEX(データ記入,$FU$5,434)=\"\",\"\",INDEX(データ記入,$FU$5,434))","v":""},null,null,null,{"$f":"IF(INDEX(データ記入,$FU$5,435)=\"\",\"\",INDEX(データ記入,$FU$5,435))","v":""},null,null,null,{"$f":"IF(INDEX(データ記入,$FU$5,436)=\"\",\"\",INDEX(データ記入,$FU$5,436))","v":""},null,null,null,{"$f":"IF(INDEX(データ記入,$FU$5,437)=\"\",\"\",INDEX(データ記入,$FU$5,437))","v":""},null,null,null,{"$f":"IF(INDEX(データ記入,$FU$5,438)=\"\",\"\",INDEX(データ記入,$FU$5,438))","v":""},null,null,null,{"$f":"IF(INDEX(データ記入,$FU$5,439)=\"\",\"\",INDEX(データ記入,$FU$5,439))","v":""},null,null,null,{"$f":"IF(INDEX(データ記入,$FU$5,440)=\"\",\"\",INDEX(データ記入,$FU$5,440))","v":""},null,null,null,{"$f":"IF(INDEX(データ記入,$FU$5,441)=\"\",\"\",INDEX(データ記入,$FU$5,441))","v":""},null,null,null,{"$f":"IF(INDEX(データ記入,$FU$5,442)=\"\",\"\",INDEX(データ記入,$FU$5,442))","v":""},null,null,null,{"$f":"IF(INDEX(データ記入,$FU$5,443)=\"\",\"\",INDEX(データ記入,$FU$5,443))","v":"○"},null,null,null,{"$f":"IF(INDEX(データ記入,$FU$5,444)=\"\",\"\",INDEX(データ記入,$FU$5,444))","v":""},null,null,null,{"$f":"IF(INDEX(データ記入,$FU$5,445)=\"\",\"\",INDEX(データ記入,$FU$5,445))","v":""},null,null,null,{"$f":"IF(INDEX(データ記入,$FU$5,446)=\"\",\"\",INDEX(データ記入,$FU$5,446))","v":""},null,null,null,{"$f":"IF(INDEX(データ記入,$FU$5,447)=\"\",\"\",INDEX(データ記入,$FU$5,447))","v":""},null,null,null,{"$f":"IF(INDEX(データ記入,$FU$5,448)=\"\",\"\",INDEX(データ記入,$FU$5,448))","v":""},null,null,null,{"$f":"IF(INDEX(データ記入,$FU$5,449)=\"\",\"\",INDEX(データ記入,$FU$5,449))","v":""},null,null,null,{"$f":"IF(INDEX(データ記入,$FU$5,450)=\"\",\"\",INDEX(データ記入,$FU$5,450))","v":""},null,null,null,{"$f":"IF(INDEX(データ記入,$FU$5,418)=\"\",\"\",INDEX(データ記入,$FU$5,418))","v":2},null,null,null,null,null,null,null,null,{"$f":"IF(INDEX(データ記入,$FU$5,419)=\"\",\"\",INDEX(データ記入,$FU$5,419))","v":3288}]
[null,6,"６月",null,null,null,null,null,null,null,null,null,null,null,null,null,{"$f":"IF(INDEX(データ記入,$FU$5,453)=\"\",\"\",INDEX(データ記入,$FU$5,453))","v":""},null,null,null,{"$f":"IF(INDEX(データ記入,$FU$5,454)=\"\",\"\",INDEX(データ記入,$FU$5,454))","v":""},null,null,null,{"$f":"IF(INDEX(データ記入,$FU$5,455)=\"\",\"\",INDEX(データ記入,$FU$5,455))","v":""},null,null,null,{"$f":"IF(INDEX(データ記入,$FU$5,456)=\"\",\"\",INDEX(データ記入,$FU$5,456))","v":""},null,null,null,{"$f":"IF(INDEX(データ記入,$FU$5,457)=\"\",\"\",INDEX(データ記入,$FU$5,457))","v":""},null,null,null,{"$f":"IF(INDEX(データ記入,$FU$5,458)=\"\",\"\",INDEX(データ記入,$FU$5,458))","v":""},null,null,null,{"$f":"IF(INDEX(データ記入,$FU$5,459)=\"\",\"\",INDEX(データ記入,$FU$5,459))","v":""},null,null,null,{"$f":"IF(INDEX(データ記入,$FU$5,460)=\"\",\"\",INDEX(データ記入,$FU$5,460))","v":""},null,null,null,{"$f":"IF(INDEX(データ記入,$FU$5,461)=\"\",\"\",INDEX(データ記入,$FU$5,461))","v":""},null,null,null,{"$f":"IF(INDEX(データ記入,$FU$5,462)=\"\",\"\",INDEX(データ記入,$FU$5,462))","v":""},null,null,null,{"$f":"IF(INDEX(データ記入,$FU$5,463)=\"\",\"\",INDEX(データ記入,$FU$5,463))","v":""},null,null,null,{"$f":"IF(INDEX(データ記入,$FU$5,464)=\"\",\"\",INDEX(データ記入,$FU$5,464))","v":""},null,null,null,{"$f":"IF(INDEX(データ記入,$FU$5,465)=\"\",\"\",INDEX(データ記入,$FU$5,465))","v":""},null,null,null,{"$f":"IF(INDEX(データ記入,$FU$5,466)=\"\",\"\",INDEX(データ記入,$FU$5,466))","v":""},null,null,null,{"$f":"IF(INDEX(データ記入,$FU$5,467)=\"\",\"\",INDEX(データ記入,$FU$5,467))","v":""},null,null,null,{"$f":"IF(INDEX(データ記入,$FU$5,468)=\"\",\"\",INDEX(データ記入,$FU$5,468))","v":""},null,null,null,{"$f":"IF(INDEX(データ記入,$FU$5,469)=\"\",\"\",INDEX(データ記入,$FU$5,469))","v":""},null,null,null,{"$f":"IF(INDEX(データ記入,$FU$5,470)=\"\",\"\",INDEX(データ記入,$FU$5,470))","v":""},null,null,null,{"$f":"IF(INDEX(データ記入,$FU$5,471)=\"\",\"\",INDEX(データ記入,$FU$5,471))","v":""},null,null,null,{"$f":"IF(INDEX(データ記入,$FU$5,472)=\"\",\"\",INDEX(データ記入,$FU$5,472))","v":""},null,null,null,{"$f":"IF(INDEX(データ記入,$FU$5,473)=\"\",\"\",INDEX(データ記入,$FU$5,473))","v":""},null,null,null,{"$f":"IF(INDEX(データ記入,$FU$5,474)=\"\",\"\",INDEX(データ記入,$FU$5,474))","v":""},null,null,null,{"$f":"IF(INDEX(データ記入,$FU$5,475)=\"\",\"\",INDEX(データ記入,$FU$5,475))","v":""},null,null,null,{"$f":"IF(INDEX(データ記入,$FU$5,476)=\"\",\"\",INDEX(データ記入,$FU$5,476))","v":""},null,null,null,{"$f":"IF(INDEX(データ記入,$FU$5,477)=\"\",\"\",INDEX(データ記入,$FU$5,477))","v":""},null,null,null,{"$f":"IF(INDEX(データ記入,$FU$5,478)=\"\",\"\",INDEX(データ記入,$FU$5,478))","v":""},null,null,null,{"$f":"IF(INDEX(データ記入,$FU$5,479)=\"\",\"\",INDEX(データ記入,$FU$5,479))","v":""},null,null,null,{"$f":"IF(INDEX(データ記入,$FU$5,480)=\"\",\"\",INDEX(データ記入,$FU$5,480))","v":""},null,null,null,{"$f":"IF(INDEX(データ記入,$FU$5,481)=\"\",\"\",INDEX(データ記入,$FU$5,481))","v":""},null,null,null,{"$f":"IF(INDEX(データ記入,$FU$5,482)=\"\",\"\",INDEX(データ記入,$FU$5,482))","v":""},null,null,null,{"$f":"IF(INDEX(データ記入,$FU$5,483)=\"\",\"\",INDEX(データ記入,$FU$5,483))","v":""},null,null,null,{"$f":"IF(INDEX(データ記入,$FU$5,451)=\"\",\"\",INDEX(データ記入,$FU$5,451))","v":""},null,null,null,null,null,null,null,null,{"$f":"IF(INDEX(データ記入,$FU$5,452)=\"\",\"\",INDEX(データ記入,$FU$5,452))","v":""}]
[null,7,"７月",null,null,null,null,null,null,null,null,null,null,null,null,null,{"$f":"IF(INDEX(データ記入,$FU$5,486)=\"\",\"\",INDEX(データ記入,$FU$5,486))","v":""},null,null,null,{"$f":"IF(INDEX(データ記入,$FU$5,487)=\"\",\"\",INDEX(データ記入,$FU$5,487))","v":""},null,null,null,{"$f":"IF(INDEX(データ記入,$FU$5,488)=\"\",\"\",INDEX(データ記入,$FU$5,488))","v":""},null,null,null,{"$f":"IF(INDEX(データ記入,$FU$5,489)=\"\",\"\",INDEX(データ記入,$FU$5,489))","v":""},null,null,null,{"$f":"IF(INDEX(データ記入,$FU$5,490)=\"\",\"\",INDEX(データ記入,$FU$5,490))","v":""},null,null,null,{"$f":"IF(INDEX(データ記入,$FU$5,491)=\"\",\"\",INDEX(データ記入,$FU$5,491))","v":""},null,null,null,{"$f":"IF(INDEX(データ記入,$FU$5,492)=\"\",\"\",INDEX(データ記入,$FU$5,492))","v":""},null,null,null,{"$f":"IF(INDEX(データ記入,$FU$5,493)=\"\",\"\",INDEX(データ記入,$FU$5,493))","v":""},null,null,null,{"$f":"IF(INDEX(データ記入,$FU$5,494)=\"\",\"\",INDEX(データ記入,$FU$5,494))","v":""},null,null,null,{"$f":"IF(INDEX(データ記入,$FU$5,495)=\"\",\"\",INDEX(データ記入,$FU$5,495))","v":""},null,null,null,{"$f":"IF(INDEX(データ記入,$FU$5,496)=\"\",\"\",INDEX(データ記入,$FU$5,496))","v":""},null,null,null,{"$f":"IF(INDEX(データ記入,$FU$5,497)=\"\",\"\",INDEX(データ記入,$FU$5,497))","v":""},null,null,null,{"$f":"IF(INDEX(データ記入,$FU$5,498)=\"\",\"\",INDEX(データ記入,$FU$5,498))","v":""},null,null,null,{"$f":"IF(INDEX(データ記入,$FU$5,499)=\"\",\"\",INDEX(データ記入,$FU$5,499))","v":""},null,null,null,{"$f":"IF(INDEX(データ記入,$FU$5,500)=\"\",\"\",INDEX(データ記入,$FU$5,500))","v":""},null,null,null,{"$f":"IF(INDEX(データ記入,$FU$5,501)=\"\",\"\",INDEX(データ記入,$FU$5,501))","v":""},null,null,null,{"$f":"IF(INDEX(データ記入,$FU$5,502)=\"\",\"\",INDEX(データ記入,$FU$5,502))","v":""},null,null,null,{"$f":"IF(INDEX(データ記入,$FU$5,503)=\"\",\"\",INDEX(データ記入,$FU$5,503))","v":""},null,null,null,{"$f":"IF(INDEX(データ記入,$FU$5,504)=\"\",\"\",INDEX(データ記入,$FU$5,504))","v":""},null,null,null,{"$f":"IF(INDEX(データ記入,$FU$5,505)=\"\",\"\",INDEX(データ記入,$FU$5,505))","v":""},null,null,null,{"$f":"IF(INDEX(データ記入,$FU$5,506)=\"\",\"\",INDEX(データ記入,$FU$5,506))","v":""},null,null,null,{"$f":"IF(INDEX(データ記入,$FU$5,507)=\"\",\"\",INDEX(データ記入,$FU$5,507))","v":""},null,null,null,{"$f":"IF(INDEX(データ記入,$FU$5,508)=\"\",\"\",INDEX(データ記入,$FU$5,508))","v":""},null,null,null,{"$f":"IF(INDEX(データ記入,$FU$5,509)=\"\",\"\",INDEX(データ記入,$FU$5,509))","v":""},null,null,null,{"$f":"IF(INDEX(データ記入,$FU$5,510)=\"\",\"\",INDEX(データ記入,$FU$5,510))","v":""},null,null,null,{"$f":"IF(INDEX(データ記入,$FU$5,511)=\"\",\"\",INDEX(データ記入,$FU$5,511))","v":""},null,null,null,{"$f":"IF(INDEX(データ記入,$FU$5,512)=\"\",\"\",INDEX(データ記入,$FU$5,512))","v":""},null,null,null,{"$f":"IF(INDEX(データ記入,$FU$5,513)=\"\",\"\",INDEX(データ記入,$FU$5,513))","v":""},null,null,null,{"$f":"IF(INDEX(データ記入,$FU$5,514)=\"\",\"\",INDEX(データ記入,$FU$5,514))","v":""},null,null,null,{"$f":"IF(INDEX(データ記入,$FU$5,515)=\"\",\"\",INDEX(データ記入,$FU$5,515))","v":""},null,null,null,{"$f":"IF(INDEX(データ記入,$FU$5,516)=\"\",\"\",INDEX(データ記入,$FU$5,516))","v":""},null,null,null,{"$f":"IF(INDEX(データ記入,$FU$5,484)=\"\",\"\",INDEX(データ記入,$FU$5,484))","v":""},null,null,null,null,null,null,null,null,{"$f":"IF(INDEX(データ記入,$FU$5,485)=\"\",\"\",INDEX(データ記入,$FU$5,485))","v":""}]
[null,8,"８月",null,null,null,null,null,null,null,null,null,null,null,null,null,{"$f":"IF(INDEX(データ記入,$FU$5,519)=\"\",\"\",INDEX(データ記入,$FU$5,519))","v":""},null,null,null,{"$f":"IF(INDEX(データ記入,$FU$5,520)=\"\",\"\",INDEX(データ記入,$FU$5,520))","v":""},null,null,null,{"$f":"IF(INDEX(データ記入,$FU$5,521)=\"\",\"\",INDEX(データ記入,$FU$5,521))","v":""},null,null,null,{"$f":"IF(INDEX(データ記入,$FU$5,522)=\"\",\"\",INDEX(データ記入,$FU$5,522))","v":""},null,null,null,{"$f":"IF(INDEX(データ記入,$FU$5,523)=\"\",\"\",INDEX(データ記入,$FU$5,523))","v":""},null,null,null,{"$f":"IF(INDEX(データ記入,$FU$5,524)=\"\",\"\",INDEX(データ記入,$FU$5,524))","v":""},null,null,null,{"$f":"IF(INDEX(データ記入,$FU$5,525)=\"\",\"\",INDEX(データ記入,$FU$5,525))","v":""},null,null,null,{"$f":"IF(INDEX(データ記入,$FU$5,526)=\"\",\"\",INDEX(データ記入,$FU$5,526))","v":""},null,null,null,{"$f":"IF(INDEX(データ記入,$FU$5,527)=\"\",\"\",INDEX(データ記入,$FU$5,527))","v":""},null,null,null,{"$f":"IF(INDEX(データ記入,$FU$5,528)=\"\",\"\",INDEX(データ記入,$FU$5,528))","v":""},null,null,null,{"$f":"IF(INDEX(データ記入,$FU$5,529)=\"\",\"\",INDEX(データ記入,$FU$5,529))","v":""},null,null,null,{"$f":"IF(INDEX(データ記入,$FU$5,530)=\"\",\"\",INDEX(データ記入,$FU$5,530))","v":""},null,null,null,{"$f":"IF(INDEX(データ記入,$FU$5,531)=\"\",\"\",INDEX(データ記入,$FU$5,531))","v":""},null,null,null,{"$f":"IF(INDEX(データ記入,$FU$5,532)=\"\",\"\",INDEX(データ記入,$FU$5,532))","v":""},null,null,null,{"$f":"IF(INDEX(データ記入,$FU$5,533)=\"\",\"\",INDEX(データ記入,$FU$5,533))","v":""},null,null,null,{"$f":"IF(INDEX(データ記入,$FU$5,534)=\"\",\"\",INDEX(データ記入,$FU$5,534))","v":""},null,null,null,{"$f":"IF(INDEX(データ記入,$FU$5,535)=\"\",\"\",INDEX(データ記入,$FU$5,535))","v":""},null,null,null,{"$f":"IF(INDEX(データ記入,$FU$5,536)=\"\",\"\",INDEX(データ記入,$FU$5,536))","v":""},null,null,null,{"$f":"IF(INDEX(データ記入,$FU$5,537)=\"\",\"\",INDEX(データ記入,$FU$5,537))","v":""},null,null,null,{"$f":"IF(INDEX(データ記入,$FU$5,538)=\"\",\"\",INDEX(データ記入,$FU$5,538))","v":""},null,null,null,{"$f":"IF(INDEX(データ記入,$FU$5,539)=\"\",\"\",INDEX(データ記入,$FU$5,539))","v":""},null,null,null,{"$f":"IF(INDEX(データ記入,$FU$5,540)=\"\",\"\",INDEX(データ記入,$FU$5,540))","v":""},null,null,null,{"$f":"IF(INDEX(データ記入,$FU$5,541)=\"\",\"\",INDEX(データ記入,$FU$5,541))","v":""},null,null,null,{"$f":"IF(INDEX(データ記入,$FU$5,542)=\"\",\"\",INDEX(データ記入,$FU$5,542))","v":""},null,null,null,{"$f":"IF(INDEX(データ記入,$FU$5,543)=\"\",\"\",INDEX(データ記入,$FU$5,543))","v":""},null,null,null,{"$f":"IF(INDEX(データ記入,$FU$5,544)=\"\",\"\",INDEX(データ記入,$FU$5,544))","v":""},null,null,null,{"$f":"IF(INDEX(データ記入,$FU$5,545)=\"\",\"\",INDEX(データ記入,$FU$5,545))","v":""},null,null,null,{"$f":"IF(INDEX(データ記入,$FU$5,546)=\"\",\"\",INDEX(データ記入,$FU$5,546))","v":""},null,null,null,{"$f":"IF(INDEX(データ記入,$FU$5,547)=\"\",\"\",INDEX(データ記入,$FU$5,547))","v":""},null,null,null,{"$f":"IF(INDEX(データ記入,$FU$5,548)=\"\",\"\",INDEX(データ記入,$FU$5,548))","v":""},null,null,null,{"$f":"IF(INDEX(データ記入,$FU$5,549)=\"\",\"\",INDEX(データ記入,$FU$5,549))","v":""},null,null,null,{"$f":"IF(INDEX(データ記入,$FU$5,517)=\"\",\"\",INDEX(データ記入,$FU$5,517))","v":""},null,null,null,null,null,null,null,null,{"$f":"IF(INDEX(データ記入,$FU$5,518)=\"\",\"\",INDEX(データ記入,$FU$5,518))","v":""}]
[null,9,"９月",null,null,null,null,null,null,null,null,null,null,null,null,null,{"$f":"IF(INDEX(データ記入,$FU$5,552)=\"\",\"\",INDEX(データ記入,$FU$5,552))","v":""},null,null,null,{"$f":"IF(INDEX(データ記入,$FU$5,553)=\"\",\"\",INDEX(データ記入,$FU$5,553))","v":""},null,null,null,{"$f":"IF(INDEX(データ記入,$FU$5,554)=\"\",\"\",INDEX(データ記入,$FU$5,554))","v":""},null,null,null,{"$f":"IF(INDEX(データ記入,$FU$5,555)=\"\",\"\",INDEX(データ記入,$FU$5,555))","v":""},null,null,null,{"$f":"IF(INDEX(データ記入,$FU$5,556)=\"\",\"\",INDEX(データ記入,$FU$5,556))","v":""},null,null,null,{"$f":"IF(INDEX(データ記入,$FU$5,557)=\"\",\"\",INDEX(データ記入,$FU$5,557))","v":""},null,null,null,{"$f":"IF(INDEX(データ記入,$FU$5,558)=\"\",\"\",INDEX(データ記入,$FU$5,558))","v":""},null,null,null,{"$f":"IF(INDEX(データ記入,$FU$5,559)=\"\",\"\",INDEX(データ記入,$FU$5,559))","v":""},null,null,null,{"$f":"IF(INDEX(データ記入,$FU$5,560)=\"\",\"\",INDEX(データ記入,$FU$5,560))","v":""},null,null,null,{"$f":"IF(INDEX(データ記入,$FU$5,561)=\"\",\"\",INDEX(データ記入,$FU$5,561))","v":"○"},null,null,null,{"$f":"IF(INDEX(データ記入,$FU$5,562)=\"\",\"\",INDEX(データ記入,$FU$5,562))","v":""},null,null,null,{"$f":"IF(INDEX(データ記入,$FU$5,563)=\"\",\"\",INDEX(データ記入,$FU$5,563))","v":""},null,null,null,{"$f":"IF(INDEX(データ記入,$FU$5,564)=\"\",\"\",INDEX(データ記入,$FU$5,564))","v":""},null,null,null,{"$f":"IF(INDEX(データ記入,$FU$5,565)=\"\",\"\",INDEX(データ記入,$FU$5,565))","v":""},null,null,null,{"$f":"IF(INDEX(データ記入,$FU$5,566)=\"\",\"\",INDEX(データ記入,$FU$5,566))","v":""},null,null,null,{"$f":"IF(INDEX(データ記入,$FU$5,567)=\"\",\"\",INDEX(データ記入,$FU$5,567))","v":""},null,null,null,{"$f":"IF(INDEX(データ記入,$FU$5,568)=\"\",\"\",INDEX(データ記入,$FU$5,568))","v":""},null,null,null,{"$f":"IF(INDEX(データ記入,$FU$5,569)=\"\",\"\",INDEX(データ記入,$FU$5,569))","v":""},null,null,null,{"$f":"IF(INDEX(データ記入,$FU$5,570)=\"\",\"\",INDEX(データ記入,$FU$5,570))","v":""},null,null,null,{"$f":"IF(INDEX(データ記入,$FU$5,571)=\"\",\"\",INDEX(データ記入,$FU$5,571))","v":""},null,null,null,{"$f":"IF(INDEX(データ記入,$FU$5,572)=\"\",\"\",INDEX(データ記入,$FU$5,572))","v":""},null,null,null,{"$f":"IF(INDEX(データ記入,$FU$5,573)=\"\",\"\",INDEX(データ記入,$FU$5,573))","v":""},null,null,null,{"$f":"IF(INDEX(データ記入,$FU$5,574)=\"\",\"\",INDEX(データ記入,$FU$5,574))","v":""},null,null,null,{"$f":"IF(INDEX(データ記入,$FU$5,575)=\"\",\"\",INDEX(データ記入,$FU$5,575))","v":"○"},null,null,null,{"$f":"IF(INDEX(データ記入,$FU$5,576)=\"\",\"\",INDEX(データ記入,$FU$5,576))","v":""},null,null,null,{"$f":"IF(INDEX(データ記入,$FU$5,577)=\"\",\"\",INDEX(データ記入,$FU$5,577))","v":""},null,null,null,{"$f":"IF(INDEX(データ記入,$FU$5,578)=\"\",\"\",INDEX(データ記入,$FU$5,578))","v":""},null,null,null,{"$f":"IF(INDEX(データ記入,$FU$5,579)=\"\",\"\",INDEX(データ記入,$FU$5,579))","v":""},null,null,null,{"$f":"IF(INDEX(データ記入,$FU$5,580)=\"\",\"\",INDEX(データ記入,$FU$5,580))","v":""},null,null,null,{"$f":"IF(INDEX(データ記入,$FU$5,581)=\"\",\"\",INDEX(データ記入,$FU$5,581))","v":""},null,null,null,{"$f":"IF(INDEX(データ記入,$FU$5,582)=\"\",\"\",INDEX(データ記入,$FU$5,582))","v":""},null,null,null,{"$f":"IF(INDEX(データ記入,$FU$5,550)=\"\",\"\",INDEX(データ記入,$FU$5,550))","v":2},null,null,null,null,null,null,null,null,{"$f":"IF(INDEX(データ記入,$FU$5,551)=\"\",\"\",INDEX(データ記入,$FU$5,551))","v":3288}]
[null,10,"１０月",null,null,null,null,null,null,null,null,null,null,null,null,null,{"$f":"IF(INDEX(データ記入,$FU$5,585)=\"\",\"\",INDEX(データ記入,$FU$5,585))","v":""},null,null,null,{"$f":"IF(INDEX(データ記入,$FU$5,586)=\"\",\"\",INDEX(データ記入,$FU$5,586))","v":""},null,null,null,{"$f":"IF(INDEX(データ記入,$FU$5,587)=\"\",\"\",INDEX(データ記入,$FU$5,587))","v":""},null,null,null,{"$f":"IF(INDEX(データ記入,$FU$5,588)=\"\",\"\",INDEX(データ記入,$FU$5,588))","v":""},null,null,null,{"$f":"IF(INDEX(データ記入,$FU$5,589)=\"\",\"\",INDEX(データ記入,$FU$5,589))","v":""},null,null,null,{"$f":"IF(INDEX(データ記入,$FU$5,590)=\"\",\"\",INDEX(データ記入,$FU$5,590))","v":""},null,null,null,{"$f":"IF(INDEX(データ記入,$FU$5,591)=\"\",\"\",INDEX(データ記入,$FU$5,591))","v":""},null,null,null,{"$f":"IF(INDEX(データ記入,$FU$5,592)=\"\",\"\",INDEX(データ記入,$FU$5,592))","v":""},null,null,null,{"$f":"IF(INDEX(データ記入,$FU$5,593)=\"\",\"\",INDEX(データ記入,$FU$5,593))","v":""},null,null,null,{"$f":"IF(INDEX(データ記入,$FU$5,594)=\"\",\"\",INDEX(データ記入,$FU$5,594))","v":""},null,null,null,{"$f":"IF(INDEX(データ記入,$FU$5,595)=\"\",\"\",INDEX(データ記入,$FU$5,595))","v":""},null,null,null,{"$f":"IF(INDEX(データ記入,$FU$5,596)=\"\",\"\",INDEX(データ記入,$FU$5,596))","v":""},null,null,null,{"$f":"IF(INDEX(データ記入,$FU$5,597)=\"\",\"\",INDEX(データ記入,$FU$5,597))","v":""},null,null,null,{"$f":"IF(INDEX(データ記入,$FU$5,598)=\"\",\"\",INDEX(データ記入,$FU$5,598))","v":""},null,null,null,{"$f":"IF(INDEX(データ記入,$FU$5,599)=\"\",\"\",INDEX(データ記入,$FU$5,599))","v":""},null,null,null,{"$f":"IF(INDEX(データ記入,$FU$5,600)=\"\",\"\",INDEX(データ記入,$FU$5,600))","v":""},null,null,null,{"$f":"IF(INDEX(データ記入,$FU$5,601)=\"\",\"\",INDEX(データ記入,$FU$5,601))","v":""},null,null,null,{"$f":"IF(INDEX(データ記入,$FU$5,602)=\"\",\"\",INDEX(データ記入,$FU$5,602))","v":""},null,null,null,{"$f":"IF(INDEX(データ記入,$FU$5,603)=\"\",\"\",INDEX(データ記入,$FU$5,603))","v":""},null,null,null,{"$f":"IF(INDEX(データ記入,$FU$5,604)=\"\",\"\",INDEX(データ記入,$FU$5,604))","v":""},null,null,null,{"$f":"IF(INDEX(データ記入,$FU$5,605)=\"\",\"\",INDEX(データ記入,$FU$5,605))","v":""},null,null,null,{"$f":"IF(INDEX(データ記入,$FU$5,606)=\"\",\"\",INDEX(データ記入,$FU$5,606))","v":""},null,null,null,{"$f":"IF(INDEX(データ記入,$FU$5,607)=\"\",\"\",INDEX(データ記入,$FU$5,607))","v":""},null,null,null,{"$f":"IF(INDEX(データ記入,$FU$5,608)=\"\",\"\",INDEX(データ記入,$FU$5,608))","v":""},null,null,null,{"$f":"IF(INDEX(データ記入,$FU$5,609)=\"\",\"\",INDEX(データ記入,$FU$5,609))","v":""},null,null,null,{"$f":"IF(INDEX(データ記入,$FU$5,610)=\"\",\"\",INDEX(データ記入,$FU$5,610))","v":""},null,null,null,{"$f":"IF(INDEX(データ記入,$FU$5,611)=\"\",\"\",INDEX(データ記入,$FU$5,611))","v":""},null,null,null,{"$f":"IF(INDEX(データ記入,$FU$5,612)=\"\",\"\",INDEX(データ記入,$FU$5,612))","v":""},null,null,null,{"$f":"IF(INDEX(データ記入,$FU$5,613)=\"\",\"\",INDEX(データ記入,$FU$5,613))","v":""},null,null,null,{"$f":"IF(INDEX(データ記入,$FU$5,614)=\"\",\"\",INDEX(データ記入,$FU$5,614))","v":""},null,null,null,{"$f":"IF(INDEX(データ記入,$FU$5,615)=\"\",\"\",INDEX(データ記入,$FU$5,615))","v":""},null,null,null,{"$f":"IF(INDEX(データ記入,$FU$5,583)=\"\",\"\",INDEX(データ記入,$FU$5,583))","v":""},null,null,null,null,null,null,null,null,{"$f":"IF(INDEX(データ記入,$FU$5,584)=\"\",\"\",INDEX(データ記入,$FU$5,584))","v":""}]
[null,11,"１１月",null,null,null,null,null,null,null,null,null,null,null,null,null,{"$f":"IF(INDEX(データ記入,$FU$5,618)=\"\",\"\",INDEX(データ記入,$FU$5,618))","v":""},null,null,null,{"$f":"IF(INDEX(データ記入,$FU$5,619)=\"\",\"\",INDEX(データ記入,$FU$5,619))","v":""},null,null,null,{"$f":"IF(INDEX(データ記入,$FU$5,620)=\"\",\"\",INDEX(データ記入,$FU$5,620))","v":""},null,null,null,{"$f":"IF(INDEX(データ記入,$FU$5,621)=\"\",\"\",INDEX(データ記入,$FU$5,621))","v":""},null,null,null,{"$f":"IF(INDEX(データ記入,$FU$5,622)=\"\",\"\",INDEX(データ記入,$FU$5,622))","v":""},null,null,null,{"$f":"IF(INDEX(データ記入,$FU$5,623)=\"\",\"\",INDEX(データ記入,$FU$5,623))","v":""},null,null,null,{"$f":"IF(INDEX(データ記入,$FU$5,624)=\"\",\"\",INDEX(データ記入,$FU$5,624))","v":""},null,null,null,{"$f":"IF(INDEX(データ記入,$FU$5,625)=\"\",\"\",INDEX(データ記入,$FU$5,625))","v":""},null,null,null,{"$f":"IF(INDEX(データ記入,$FU$5,626)=\"\",\"\",INDEX(データ記入,$FU$5,626))","v":""},null,null,null,{"$f":"IF(INDEX(データ記入,$FU$5,627)=\"\",\"\",INDEX(データ記入,$FU$5,627))","v":""},null,null,null,{"$f":"IF(INDEX(データ記入,$FU$5,628)=\"\",\"\",INDEX(データ記入,$FU$5,628))","v":""},null,null,null,{"$f":"IF(INDEX(データ記入,$FU$5,629)=\"\",\"\",INDEX(データ記入,$FU$5,629))","v":""},null,null,null,{"$f":"IF(INDEX(データ記入,$FU$5,630)=\"\",\"\",INDEX(データ記入,$FU$5,630))","v":""},null,null,null,{"$f":"IF(INDEX(データ記入,$FU$5,631)=\"\",\"\",INDEX(データ記入,$FU$5,631))","v":""},null,null,null,{"$f":"IF(INDEX(データ記入,$FU$5,632)=\"\",\"\",INDEX(データ記入,$FU$5,632))","v":""},null,null,null,{"$f":"IF(INDEX(データ記入,$FU$5,633)=\"\",\"\",INDEX(データ記入,$FU$5,633))","v":""},null,null,null,{"$f":"IF(INDEX(データ記入,$FU$5,634)=\"\",\"\",INDEX(データ記入,$FU$5,634))","v":""},null,null,null,{"$f":"IF(INDEX(データ記入,$FU$5,635)=\"\",\"\",INDEX(データ記入,$FU$5,635))","v":""},null,null,null,{"$f":"IF(INDEX(データ記入,$FU$5,636)=\"\",\"\",INDEX(データ記入,$FU$5,636))","v":""},null,null,null,{"$f":"IF(INDEX(データ記入,$FU$5,637)=\"\",\"\",INDEX(データ記入,$FU$5,637))","v":""},null,null,null,{"$f":"IF(INDEX(データ記入,$FU$5,638)=\"\",\"\",INDEX(データ記入,$FU$5,638))","v":""},null,null,null,{"$f":"IF(INDEX(データ記入,$FU$5,639)=\"\",\"\",INDEX(データ記入,$FU$5,639))","v":""},null,null,null,{"$f":"IF(INDEX(データ記入,$FU$5,640)=\"\",\"\",INDEX(データ記入,$FU$5,640))","v":""},null,null,null,{"$f":"IF(INDEX(データ記入,$FU$5,641)=\"\",\"\",INDEX(データ記入,$FU$5,641))","v":""},null,null,null,{"$f":"IF(INDEX(データ記入,$FU$5,642)=\"\",\"\",INDEX(データ記入,$FU$5,642))","v":""},null,null,null,{"$f":"IF(INDEX(データ記入,$FU$5,643)=\"\",\"\",INDEX(データ記入,$FU$5,643))","v":""},null,null,null,{"$f":"IF(INDEX(データ記入,$FU$5,644)=\"\",\"\",INDEX(データ記入,$FU$5,644))","v":""},null,null,null,{"$f":"IF(INDEX(データ記入,$FU$5,645)=\"\",\"\",INDEX(データ記入,$FU$5,645))","v":""},null,null,null,{"$f":"IF(INDEX(データ記入,$FU$5,646)=\"\",\"\",INDEX(データ記入,$FU$5,646))","v":""},null,null,null,{"$f":"IF(INDEX(データ記入,$FU$5,647)=\"\",\"\",INDEX(データ記入,$FU$5,647))","v":""},null,null,null,{"$f":"IF(INDEX(データ記入,$FU$5,648)=\"\",\"\",INDEX(データ記入,$FU$5,648))","v":""},null,null,null,{"$f":"IF(INDEX(データ記入,$FU$5,616)=\"\",\"\",INDEX(データ記入,$FU$5,616))","v":""},null,null,null,null,null,null,null,null,{"$f":"IF(INDEX(データ記入,$FU$5,617)=\"\",\"\",INDEX(データ記入,$FU$5,617))","v":""}]
[null,12,"１２月",null,null,null,null,null,null,null,null,null,null,null,null,null,{"$f":"IF(INDEX(データ記入,$FU$5,651)=\"\",\"\",INDEX(データ記入,$FU$5,651))","v":""},null,null,null,{"$f":"IF(INDEX(データ記入,$FU$5,652)=\"\",\"\",INDEX(データ記入,$FU$5,652))","v":""},null,null,null,{"$f":"IF(INDEX(データ記入,$FU$5,653)=\"\",\"\",INDEX(データ記入,$FU$5,653))","v":""},null,null,null,{"$f":"IF(INDEX(データ記入,$FU$5,654)=\"\",\"\",INDEX(データ記入,$FU$5,654))","v":""},null,null,null,{"$f":"IF(INDEX(データ記入,$FU$5,655)=\"\",\"\",INDEX(データ記入,$FU$5,655))","v":""},null,null,null,{"$f":"IF(INDEX(データ記入,$FU$5,656)=\"\",\"\",INDEX(データ記入,$FU$5,656))","v":""},null,null,null,{"$f":"IF(INDEX(データ記入,$FU$5,657)=\"\",\"\",INDEX(データ記入,$FU$5,657))","v":""},null,null,null,{"$f":"IF(INDEX(データ記入,$FU$5,658)=\"\",\"\",INDEX(データ記入,$FU$5,658))","v":""},null,null,null,{"$f":"IF(INDEX(データ記入,$FU$5,659)=\"\",\"\",INDEX(データ記入,$FU$5,659))","v":""},null,null,null,{"$f":"IF(INDEX(データ記入,$FU$5,660)=\"\",\"\",INDEX(データ記入,$FU$5,660))","v":""},null,null,null,{"$f":"IF(INDEX(データ記入,$FU$5,661)=\"\",\"\",INDEX(データ記入,$FU$5,661))","v":""},null,null,null,{"$f":"IF(INDEX(データ記入,$FU$5,662)=\"\",\"\",INDEX(データ記入,$FU$5,662))","v":""},null,null,null,{"$f":"IF(INDEX(データ記入,$FU$5,663)=\"\",\"\",INDEX(データ記入,$FU$5,663))","v":""},null,null,null,{"$f":"IF(INDEX(データ記入,$FU$5,664)=\"\",\"\",INDEX(データ記入,$FU$5,664))","v":""},null,null,null,{"$f":"IF(INDEX(データ記入,$FU$5,665)=\"\",\"\",INDEX(データ記入,$FU$5,665))","v":""},null,null,null,{"$f":"IF(INDEX(データ記入,$FU$5,666)=\"\",\"\",INDEX(データ記入,$FU$5,666))","v":""},null,null,null,{"$f":"IF(INDEX(データ記入,$FU$5,667)=\"\",\"\",INDEX(データ記入,$FU$5,667))","v":""},null,null,null,{"$f":"IF(INDEX(データ記入,$FU$5,668)=\"\",\"\",INDEX(データ記入,$FU$5,668))","v":""},null,null,null,{"$f":"IF(INDEX(データ記入,$FU$5,669)=\"\",\"\",INDEX(データ記入,$FU$5,669))","v":""},null,null,null,{"$f":"IF(INDEX(データ記入,$FU$5,670)=\"\",\"\",INDEX(データ記入,$FU$5,670))","v":""},null,null,null,{"$f":"IF(INDEX(データ記入,$FU$5,671)=\"\",\"\",INDEX(データ記入,$FU$5,671))","v":""},null,null,null,{"$f":"IF(INDEX(データ記入,$FU$5,672)=\"\",\"\",INDEX(データ記入,$FU$5,672))","v":""},null,null,null,{"$f":"IF(INDEX(データ記入,$FU$5,673)=\"\",\"\",INDEX(データ記入,$FU$5,673))","v":""},null,null,null,{"$f":"IF(INDEX(データ記入,$FU$5,674)=\"\",\"\",INDEX(データ記入,$FU$5,674))","v":""},null,null,null,{"$f":"IF(INDEX(データ記入,$FU$5,675)=\"\",\"\",INDEX(データ記入,$FU$5,675))","v":""},null,null,null,{"$f":"IF(INDEX(データ記入,$FU$5,676)=\"\",\"\",INDEX(データ記入,$FU$5,676))","v":""},null,null,null,{"$f":"IF(INDEX(データ記入,$FU$5,677)=\"\",\"\",INDEX(データ記入,$FU$5,677))","v":""},null,null,null,{"$f":"IF(INDEX(データ記入,$FU$5,678)=\"\",\"\",INDEX(データ記入,$FU$5,678))","v":""},null,null,null,{"$f":"IF(INDEX(データ記入,$FU$5,679)=\"\",\"\",INDEX(データ記入,$FU$5,679))","v":""},null,null,null,{"$f":"IF(INDEX(データ記入,$FU$5,680)=\"\",\"\",INDEX(データ記入,$FU$5,680))","v":""},null,null,null,{"$f":"IF(INDEX(データ記入,$FU$5,681)=\"\",\"\",INDEX(データ記入,$FU$5,681))","v":""},null,null,null,{"$f":"IF(INDEX(データ記入,$FU$5,649)=\"\",\"\",INDEX(データ記入,$FU$5,649))","v":""},null,null,null,null,null,null,null,null,{"$f":"IF(INDEX(データ記入,$FU$5,650)=\"\",\"\",INDEX(データ記入,$FU$5,650))","v":""}]
[]
[null,null,null,null,null,null,null,null,null,null,null,null,null,null,null,null,null,null,null,null,null,null,null,null,null,null,null,null,null,null,null,null,null,null,null,null,null,null,null,null,null,null,null,null,null,null,null,null,null,null,null,null,null,null,null,null,null,null,null,null,null,null,null,null,null,null,null,null,null,null,null,null,null,null,null,null,null,null,null,null,null,null,null,{"$f":"IF(INDEX(データ記入,$FU$5,42)=\"\",\"\",INDEX(データ記入,$FU$5,42))","v":""}]
[]
[]
[]
[]
[]
[null,null,null,null,null,null,null,null,null,null,null,null,null,null,null,null,null,null,null,null,null,null,null,null,null,null,null,null,null,null,null,null,null,null,null,null,null,null,null,null,null,null,null,null,null,null,null,null,null,null,null,null,null,null,null,null,null,null,null,null,null,null,null,null,null,null,null,null,null,null,null,null,null,null,null,null,null,null,null,null,null,null,null,null,{"$f":"IF(INDEX(データ記入,$FU$5,41)=\"\",\"\",INDEX(データ記入,$FU$5,41))","v":"首から方にかけて痛みと痺れがあり、パソコンでの仕事が続けてできない。鍼灸をすると首肩が軽くなり動きがよくなると話す。以前よりも笑顔が増えたと家族が言うとのこと。"}]

{"sheet":"頻回施術理由（表）","index":5,"n_rows":21,"n_cols":39,"rows_kept":21,"cut":false,"hidden":false,"merged":[[1,1,2,20],[1,21,2,26],[3,0,5,0],[3,1,4,6],[3,7,3,9],[3,10,3,26],[4,7,4,9],[4,10,4,26],[5,1,6,6],[5,7,5,26],[6,7,6,26],[7,1,7,6],[7,7,7,26],[8,0,9,0],[8,1,8,6],[8,7,8,26],[9,1,9,6],[9,7,9,26],[18,1,19,26],[20,1,20,26],[10,1,10,26],[11,1,11,26],[12,1,13,26],[14,1,14,26],[15,1,16,26],[17,1,17,26]]}
[null,null,null,null,null,null,null,null,null,null,null,null,null,null,null,null,null,null,null,null,null,null,null,null,null,null,"別添１（様式第11号）"]
[null,"頻回な施術を必要とした詳細な理由及び今後の施術計画書",null,null,null,null,null,null,null,null,null,null,null,null,null,null,null,null,null,null,null,"（はり・きゅう用）"]
[]
["患　　　者","患者",null,null,null,null,null,"氏名"]
[null,null,null,null,null,null,null,"生年月日",null,null,"明 ・ 大 ・ 昭 ・ 平 ・ 令　　　　年　　　月　　　日"]
[null,"傷病名",null,null,null,null,null,"１．神経痛　 ２．リウマチ 　３．頸腕症候群　 ４．五十肩"]
[null,null,null,null,null,null,null,"５．腰痛症　 ６．頸椎捻挫後遺症 　７．その他（　　　　 　　　　）"]
[null,"施術の種類",null,null,null,null,null,"１．はり　　　　２．きゅう　　　　３．はり・きゅう併用",null,null,null,null,null,null,null,null,null,null,null,null,null,null,null,null,null,null,null,null,null,null,null,null,null,null,null,null,"S","H","R"]
[null,"初療年月日",null,null,null,null,null,"平 ・ 令　　　年　　　月　　　日",null,null,null,null,null,null,null,null,null,null,null,null,null,null,null,null,null,null,null,null,null,null,null,null,null,null,null,null,{"$f":"IF(申請書!$DC$34=\"S\",\"○\",\"\")","v":""},{"$f":"IF(申請書!$DC$34=\"H\",\"○\",\"\")","v":""},{"$f":"IF(申請書!$DC$34=\"R\",\"○\",\"\")","v":"○"}]
[null,"施術回数",null,null,null,null,null,"　　　　　回　　（当該月の施術回数を記載）"]
[null,"１．頻回な施術を必要とした詳細な理由について"]
[null,"（患者の症状、経過を時系列で記載すること）"]
[]
[]
[null,"（上記に対する施術師の所見を記載すること）"]
[]
[]
[null,"（２年以上経過してもなお月16回以上の施術が必要な詳細な理由を記載すること）"]
[null,"【裏面へ続く】"]
[]
[null,"※　（患者の症状、経過を時系列で記載すること）及び（上記に対する施術師の所見を記載すること）については、施術録の\n  （写）添付でも差し支えない。"]

{"sheet":"頻回施術理由（裏）","index":6,"n_rows":18,"n_cols":16,"rows_kept":18,"cut":false,"hidden":false,"merged":[[7,1,7,26],[1,1,1,26],[2,1,2,26],[3,1,3,26],[4,1,4,26],[5,1,5,26],[6,1,6,26],[14,1,14,26],[16,1,16,26],[17,1,17,26],[8,1,8,26],[9,1,9,26],[10,1,10,26],[11,1,11,26],[12,1,12,26],[13,1,13,26],[15,15,15,22]]}
[]
[null,"２．今後の施術計画について"]
[null,"（今後の施術内容及び施術の頻度（月○回など具体的に記載すること））"]
[]
[null,"　（頻回月から現在までの症状経過（症状、疼痛レベルの推移））"]
[]
[null,"　　（今後の施術計画（６ヶ月から１年先の目標））"]
[]
[null,"３．今後の施術計画に関する同意及び確認"]
[null,"　　（本人又は家族、親族の署名）"]
[]
[null,"　　上記のとおりであります。"]
[]
[null,"　　　　　　令和　　　年　　　月　　　日"]
[]
[null,"　　　　　　はり師・きゅう師氏名　　     　　　　　　　    　",null,null,null,null,null,null,null,null,null,null,null,null,null,{"$f":"申請書!AQ64","v":"福岡太郎"}]
[]
[null,"備考　　記載欄が不足する場合には、別葉にまとめて提出することは差し支えない。"]